{"text_format":"1","workbook":"xlsx","n_sheets":3,"sheets":["calcolo handicap","storico gare","elenco campi italiani"],"not_rendered":{"charts":0,"images":2,"macros":1,"external_links":0,"defined_names":14,"comments":0,"pivot_tables":0},"unopened":[],"bounds":{"document_bytes":16777216,"sheet_cells":100000,"rows_first":2000,"rows_last":500,"rows_between":2000,"halvings":0,"cell_chars":16384,"cell_head_chars":4096},"cells_cut":0,"cells_raw":0,"read":"whole","date_system":"1900"}

{"sheet":"calcolo handicap","index":0,"n_rows":97,"n_cols":17,"rows_kept":97,"cut":false,"hidden":false,"merged":[[21,1,21,4],[20,6,20,9],[1,2,1,4],[18,1,18,4],[9,6,9,9],[10,6,10,9],[17,6,17,9],[15,6,15,9],[16,6,16,9],[11,1,11,3],[19,6,19,9],[16,1,16,3],[22,6,22,9],[23,6,23,9],[24,6,24,9],[27,6,27,9],[28,6,28,9],[25,6,25,9],[26,6,26,9],[29,6,29,9],[30,6,30,9],[31,6,31,9],[32,6,32,9],[33,6,33,9],[39,6,39,9],[40,6,40,9],[41,6,41,9],[34,6,34,9],[35,6,35,9],[36,6,36,9],[37,6,37,9],[38,6,38,9]]}
[]
[null,"Scelta circolo e percorso","Data Gara"]
[null,"LECCO 18 Buche",null,{"$f":"TODAY()","v":"2021-04-28"}]
[null,"Scelta tee di gioco",null,"Handicap di gioco"]
[null,"giallo",null,{"$f":"IF('elenco campi italiani'!X11=0,\"NO TEE\",IF('elenco campi italiani'!AA11=9,ROUND(+(B7*'elenco campi italiani'!Y11/113+('elenco campi italiani'!X11-'elenco campi italiani'!W11)*2)/2,0),ROUND(+B7*'elenco campi italiani'!Y11/113+'elenco campi italiani'!X11-'elenco campi italiani'!W11,0)))","v":15}]
[null,"Inserire hcp attuale",null,"risultato SD"]
[null,12.4,null,{"$f":"IF(D3>44197,IF('elenco campi italiani'!X11=0,\"NO TEE\",IF('elenco campi italiani'!AA11=9,+'elenco campi italiani'!AA18,+'elenco campi italiani'!W18)),IF('elenco campi italiani'!X11=0,\"NO TEE\",IF('elenco campi italiani'!AA11=9,B7-2*('elenco campi italiani'!AA14+B11)*113/'elenco campi italiani'!Y11,B7-('elenco campi italiani'!W14+B11)*113/'elenco campi italiani'!Y11)))","v":11.885400000000002}]
[null,"Inserire risultato gara"]
[null,37]
[null,"Inserire pcc gara",null,"NUOVO HANDICAP",null,null,"Associazione  \"La Vita è un Dono\""]
[null,0,null,{"$f":"IF('storico gare'!G11=\"\",\"< 8 GARE\",IF('storico gare'!G12=\"\",SUM('storico gare'!I4:I5)/2,IF('storico gare'!G15=\"\",SUM('storico gare'!I4:I6)/3,IF('storico gare'!G18=\"\",SUM('storico gare'!I4:I7)/4,IF('storico gare'!G20=\"\",SUM('storico gare'!I4:I8)/5,IF('storico gare'!G22=\"\",SUM('storico gare'!I4:I9)/6,IF('storico gare'!G23=\"\",SUM('storico gare'!I4:I10)/7,SUM('storico gare'!I4:I11)/8)))))))","v":"< 8 GARE"},null,null,"Associazione Italiana Ingegneri Golfisti"]
[null,"PUNTEGGI MINIMI PROSSIMA GARA",null,null,null,null,null,"INFO@LAVITAEUNDONO.ORG"]
[null," PER SCENDERE",null,"PER NON SALIRE",null,null,null,"WWW.LAVITAEUNDONO.ORG"]
[null,{"$f":"IF(E24<>\"\",+C24-0.1,\"< 8 GARE\")","v":"< 8 GARE"},"SD",{"$f":"IF(E24<>20,\"qualsiasi\",+C24)","v":"qualsiasi"},null,null,null,"SEGRETERIA.AIIG@GMAIL.COM"]
[null,{"$f":"IF(E24<>\"\",IF('elenco campi italiani'!AA11=18,CEILING(-B14/'elenco campi italiani'!V11+36+D5+'elenco campi italiani'!W11-'elenco campi italiani'!X11,1),CEILING(-B14/'elenco campi italiani'!V11+19+2*D5+2*'elenco campi italiani'!W11-2*'elenco campi italiani'!X11,1)),\"< 8 GARE\")","v":"< 8 GARE"},"STB",{"$f":"IF(D14=\"qualsiasi\",D14,IF('elenco campi italiani'!AA11=18,CEILING(-D14/'elenco campi italiani'!V11+36+D5+'elenco campi italiani'!W11-'elenco campi italiani'!X11,1),CEILING(-D14/'elenco campi italiani'!V11+19+2*D5+2*'elenco campi italiani'!W11-2*'elenco campi italiani'!X11,1)))","v":"qualsiasi"},null,null,null,"WWW.ASSIIG.NET"]
[null," PER ENTRARE NEI MIGLIORI 8","STB",{"$f":"IF(E24<>\"\",IF(E24=20,IF('elenco campi italiani'!AA11=18,CEILING(-'storico gare'!I12/'elenco campi italiani'!V11+36+D5+'elenco campi italiani'!W11-'elenco campi italiani'!X11,1),CEILING(-'storico gare'!I12/'elenco campi italiani'!V11+19+2*D5+2*'elenco campi italiani'!W11-2*'elenco campi italiani'!X11,1)),B15),\"<= 8 GARE\")","v":"<= 8 GARE"},null,null,"DOMENICA 29 AGOSTO 2021"]
[null," PER FARE EXCEPTIONAL SCORE NELLA PROSSIMA GARA",null,null,{"$f":"IF('elenco campi italiani'!AA11=18,CEILING(-(B7-7)/'elenco campi italiani'!V11+36+D5+'elenco campi italiani'!W11-'elenco campi italiani'!X11,1),CEILING(-(B7-7)/'elenco campi italiani'!V11+19+2*D5+2*'elenco campi italiani'!W11-2*'elenco campi italiani'!X11,1))","v":45},null,"GOLF CLUB LECCO"]
[null,null,null,null,null,null,"XIV MEMORIAL DAVIDE CARBONE - AIIG"]
[null,"ULTIMA GARA MEMORIZZATA"]
[null,"CAMPO","SD","DATA","N",null,"per ascoltare le istruzioni per utilizzare il file"]
[null,null,null,null,null,null,"https://youtu.be/YrOqx8E-0Ug"]
[null,"PROSSIMA GARA DA SCARTARE"]
[null,"CAMPO","SD","DATA","N",null,"Aggiornamenti da versioni precedenti"]
[null,{"$f":"IF('storico gare'!F4=20,'storico gare'!H4,IF('storico gare'!F5=20,'storico gare'!H5,IF('storico gare'!F6=20,'storico gare'!H6,IF('storico gare'!F7=20,'storico gare'!H7,IF('storico gare'!F8=20,'storico gare'!H8,IF('storico gare'!F9=20,'storico gare'!H9,IF('storico gare'!F10=20,'storico gare'!H10,IF('storico gare'!G11=\"\",\"< 8 GARE\",'storico gare'!H11))))))))","v":"< 8 GARE"},{"$f":"IF('storico gare'!F4=20,'storico gare'!I4,IF('storico gare'!F5=20,'storico gare'!I5,IF('storico gare'!F6=20,'storico gare'!I6,IF('storico gare'!F7=20,'storico gare'!I7,IF('storico gare'!F8=20,'storico gare'!I8,IF('storico gare'!F9=20,'storico gare'!I9,IF('storico gare'!F10=20,'storico gare'!I10,IF('storico gare'!G11=\"\",\"\",'storico gare'!I11))))))))","v":""},{"$f":"IF('storico gare'!F4=20,'storico gare'!G4,IF('storico gare'!F5=20,'storico gare'!G5,IF('storico gare'!F6=20,'storico gare'!G6,IF('storico gare'!F7=20,'storico gare'!G7,IF('storico gare'!F8=20,'storico gare'!G8,IF('storico gare'!F9=20,'storico gare'!G9,IF('storico gare'!F10=20,'storico gare'!G10,IF('storico gare'!G11=\"\",\"< 8 GARE\",'storico gare'!G11))))))))","v":"< 8 GARE"},{"$f":"IF('storico gare'!F4=20,'storico gare'!F4,IF('storico gare'!F5=20,'storico gare'!F5,IF('storico gare'!F6=20,'storico gare'!F6,IF('storico gare'!F7=20,'storico gare'!F7,IF('storico gare'!F8=20,'storico gare'!F8,IF('storico gare'!F9=20,'storico gare'!F9,IF('storico gare'!F10=20,'storico gare'!F10,IF('storico gare'!G11=\"\",\"\",'storico gare'!F11))))))))","v":""},null,"1- calcolo SD rivisto in base all'anno della gara, "]
[null,null,null,null,null,null,"  perché da 1-1-21 l'algoritmo di calcolo è cambiato"]
[null,null,null,null,null,null,"2- aggiunto il pulsante \"Elimina Risultato Gara\" così"]
[null,null,null,null,null,null,"  vengono rimesse in ordine le gare precedenti"]
[null,null,null,null,null,null,"3- aggiunto il calcolo dell’exceptional score, che però"]
[null,null,null,null,null,null,"  non viene considerato nella media dei migliori 8"]
[null,null,null,null,null,null,"4- aggiunta la casella “Per entrare nei migliori 8” perchè, "]
[null,null,null,null,null,null,"  nel caso la gara n.20 da scartare sia anche una delle "]
[null,null,null,null,null,null,"  prime 8, manca un'informazione, cioè non basta sapere"]
[null,null,null,null,null,null,"  il valore per scendere e quello per non salire, serve "]
[null,null,null,null,null,null,"  anche sapere quale risultato ti fornisce comunque un "]
[null,null,null,null,null,null,"  SD che sia nei migliori 8, ad esempio se la gara n.20 è"]
[null,null,null,null,null,null,"  la migliore di tutte, per cui sarà scartata sicuramente, "]
[null,null,null,null,null,null,"  sapere quale risultato ti serve per evitare che il 9°"]
[null,null,null,null,null,null,"   risultato entri nei migliori 8 è comunque importante, "]
[null,null,null,null,null,null,"  almeno sai prima di giocare che con 38 scendi, con 37 "]
[null,null,null,null,null,null,"  magari non sali, ma un 30 o un 31 ti entra comunque "]
[null,null,null,null,null,null,"  nei migliori 8, per cui ha un senso anche cercare di "]
[null,null,null,null,null,null,"  imbucare l’ultimo putt alla 18 per fare 31!!!"]
[]
[]
[]
[]
[null,null,null,null,null,null,null,null,null,null,null,null,null,null,null,null,0]
[null,null,null,null,null,null,null,null,null,null,null,null,null,null,null,null,{"$f":"1+Q47","v":1}]
[null,null,null,null,null,null,null,null,null,null,null,null,null,null,null,null,{"$f":"1+Q48","v":2}]
[null,null,null,null,null,null,null,null,null,null,null,null,null,null,null,null,{"$f":"1+Q49","v":3}]
[null,null,null,null,null,null,null,null,null,null,null,null,null,null,null,null,4]
[null,null,null,null,null,null,null,null,null,null,null,null,null,null,null,null,5]
[null,null,null,null,null,null,null,null,null,null,null,null,null,null,null,null,6]
[null,null,null,null,null,null,null,null,null,null,null,null,null,null,null,null,7]
[null,null,null,null,null,null,null,null,null,null,null,null,null,null,null,null,8]
[null,null,null,null,null,null,null,null,null,null,null,null,null,null,null,null,9]
[null,null,null,null,null,null,null,null,null,null,null,null,null,null,null,null,10]
[null,null,null,null,null,null,null,null,null,null,null,null,null,null,null,null,11]
[null,null,null,null,null,null,null,null,null,null,null,null,null,null,null,null,12]
[null,null,null,null,null,null,null,null,null,null,null,null,null,null,null,null,13]
[null,null,null,null,null,null,null,null,null,null,null,null,null,null,null,null,14]
[null,null,null,null,null,null,null,null,null,null,null,null,null,null,null,null,15]
[null,null,null,null,null,null,null,null,null,null,null,null,null,null,null,null,16]
[null,null,null,null,null,null,null,null,null,null,null,null,null,null,null,null,17]
[null,null,null,null,null,null,null,null,null,null,null,null,null,null,null,null,18]
[null,null,null,null,null,null,null,null,null,null,null,null,null,null,null,null,19]
[null,null,null,null,null,null,null,null,null,null,null,null,null,null,null,null,20]
[null,null,null,null,null,null,null,null,null,null,null,null,null,null,null,null,21]
[null,null,null,null,null,null,null,null,null,null,null,null,null,null,null,null,22]
[null,null,null,null,null,null,null,null,null,null,null,null,null,null,null,null,23]
[null,null,null,null,null,null,null,null,null,null,null,null,null,null,null,null,24]
[null,null,null,null,null,null,null,null,null,null,null,null,null,null,null,null,25]
[null,null,null,null,null,null,null,null,null,null,null,null,null,null,null,null,26]
[null,null,null,null,null,null,null,null,null,null,null,null,null,null,null,null,27]
[null,null,null,null,null,null,null,null,null,null,null,null,null,null,null,null,28]
[null,null,null,null,null,null,null,null,null,null,null,null,null,null,null,null,29]
[null,null,null,null,null,null,null,null,null,null,null,null,null,null,null,null,30]
[null,null,null,null,null,null,null,null,null,null,null,null,null,null,null,null,31]
[null,null,null,null,null,null,null,null,null,null,null,null,null,null,null,null,32]
[null,null,null,null,null,null,null,null,null,null,null,null,null,null,null,null,33]
[null,null,null,null,null,null,null,null,null,null,null,null,null,null,null,null,34]
[null,null,null,null,null,null,null,null,null,null,null,null,null,null,null,null,35]
[null,null,null,null,null,null,null,null,null,null,null,null,null,null,null,null,36]
[null,null,null,null,null,null,null,null,null,null,null,null,null,null,null,null,37]
[null,null,null,null,null,null,null,null,null,null,null,null,null,null,null,null,38]
[null,null,null,null,null,null,null,null,null,null,null,null,null,null,null,null,39]
[null,null,null,null,null,null,null,null,null,null,null,null,null,null,null,null,40]
[null,null,null,null,null,null,null,null,null,null,null,null,null,null,null,null,41]
[null,null,null,null,null,null,null,null,null,null,null,null,null,null,null,null,42]
[null,null,null,null,null,null,null,null,null,null,null,null,null,null,null,null,43]
[null,null,null,null,null,null,null,null,null,null,null,null,null,null,null,null,44]
[null,null,null,null,null,null,null,null,null,null,null,null,null,null,null,null,45]
[null,null,null,null,null,null,null,null,null,null,null,null,null,null,null,null,46]
[null,null,null,null,null,null,null,null,null,null,null,null,null,null,null,null,47]
[null,null,null,null,null,null,null,null,null,null,null,null,null,null,null,null,48]
[null,null,null,null,null,null,null,null,null,null,null,null,null,null,null,null,49]
[null,null,null,null,null,null,null,null,null,null,null,null,null,null,null,null,50]

{"sheet":"storico gare","index":1,"n_rows":1002,"n_cols":9,"rows_kept":1002,"cut":false,"hidden":false,"merged":[[1,1,1,4],[1,5,1,8]]}
[]
[null," GARE MEMORIZZATE IN ORDINE DI DATA",null,null,null,"MIGLIORI 8 RISULTATI SU 20"]
[null,"N","DATA","CAMPO","SD","N","DATA","CAMPO","SD"]
[null,1,null,null,null,1]
[null,2,null,null,null,2]
[null,3,null,null,null,3]
[null,4,null,null,null,4]
[null,5,null,null,null,5]
[null,6,null,null,null,6]
[null,7,null,null,null,7]
[null,8,null,null,null,8]
[null,9,null,null,null,9]
[null,10,null,null,null,10]
[null,11,null,null,null,11]
[null,12,null,null,null,12]
[null,13,null,null,null,13]
[null,14,null,null,null,14]
[null,15,null,null,null,15]
[null,16,null,null,null,16]
[null,17,null,null,null,17]
[null,18,null,null,null,18]
[null,19,null,null,null,19]
[null,20,null,null,null,20]
[null,21]
[null,{"$f":"1+B24","v":22}]
[null,23]
[null,24]
[null,25]
[null,26]
[null,27]
[null,28]
[null,29]
[null,30]
[null,31]
[null,32]
[null,33]
[null,34]
[null,35]
[null,36]
[null,37]
[null,38]
[null,39]
[null,40]
[null,41]
[null,42]
[null,43]
[null,44]
[null,45]
[null,46]
[null,47]
[null,48]
[null,49]
[null,50]
[null,51]
[null,52]
[null,53]
[null,54]
[null,55]
[null,56]
[null,57]
[null,58]
[null,59]
[null,60]
[null,61]
[null,62]
[null,63]
[null,64]
[null,65]
[null,{"$f":"1+B68","v":66}]
[null,67]
[null,68]
[null,69]
[null,70]
[null,71]
[null,72]
[null,73]
[null,74]
[null,75]
[null,76]
[null,77]
[null,78]
[null,79]
[null,80]
[null,81]
[null,82]
[null,83]
[null,84]
[null,85]
[null,86]
[null,87]
[null,88]
[null,89]
[null,90]
[null,91]
[null,92]
[null,93]
[null,94]
[null,95]
[null,96]
[null,97]
[null,98]
[null,99]
[null,100]
[null,101]
[null,102]
[null,103]
[null,104]
[null,105]
[null,106]
[null,107]
[null,108]
[null,109]
[null,110]
[null,111]
[null,112]
[null,113]
[null,114]
[null,115]
[null,116]
[null,117]
[null,118]
[null,119]
[null,120]
[null,121]
[null,122]
[null,123]
[null,124]
[null,125]
[null,126]
[null,127]
[null,128]
[null,129]
[null,{"$f":"1+B132","v":130}]
[null,131]
[null,132]
[null,133]
[null,134]
[null,135]
[null,136]
[null,137]
[null,138]
[null,139]
[null,140]
[null,141]
[null,142]
[null,143]
[null,144]
[null,145]
[null,146]
[null,147]
[null,148]
[null,149]
[null,150]
[null,151]
[null,152]
[null,153]
[null,154]
[null,155]
[null,156]
[null,157]
[null,158]
[null,159]
[null,160]
[null,161]
[null,162]
[null,163]
[null,164]
[null,165]
[null,166]
[null,167]
[null,168]
[null,169]
[null,170]
[null,171]
[null,172]
[null,173]
[null,174]
[null,175]
[null,176]
[null,177]
[null,178]
[null,179]
[null,180]
[null,181]
[null,182]
[null,183]
[null,184]
[null,185]
[null,186]
[null,187]
[null,188]
[null,189]
[null,190]
[null,191]
[null,192]
[null,193]
[null,{"$f":"1+B196","v":194}]
[null,195]
[null,196]
[null,197]
[null,198]
[null,199]
[null,200]
[null,201]
[null,202]
[null,203]
[null,204]
[null,205]
[null,206]
[null,207]
[null,208]
[null,209]
[null,210]
[null,211]
[null,212]
[null,213]
[null,214]
[null,215]
[null,216]
[null,217]
[null,218]
[null,219]
[null,220]
[null,221]
[null,222]
[null,223]
[null,224]
[null,225]
[null,226]
[null,227]
[null,228]
[null,229]
[null,230]
[null,231]
[null,232]
[null,233]
[null,234]
[null,235]
[null,236]
[null,237]
[null,238]
[null,239]
[null,240]
[null,241]
[null,242]
[null,243]
[null,244]
[null,245]
[null,246]
[null,247]
[null,248]
[null,249]
[null,250]
[null,251]
[null,252]
[null,253]
[null,254]
[null,255]
[null,256]
[null,257]
[null,{"$f":"1+B260","v":258}]
[null,259]
[null,260]
[null,261]
[null,262]
[null,263]
[null,264]
[null,265]
[null,266]
[null,267]
[null,268]
[null,269]
[null,270]
[null,271]
[null,272]
[null,273]
[null,274]
[null,275]
[null,276]
[null,277]
[null,278]
[null,279]
[null,280]
[null,281]
[null,282]
[null,283]
[null,284]
[null,285]
[null,286]
[null,287]
[null,288]
[null,289]
[null,290]
[null,291]
[null,292]
[null,293]
[null,294]
[null,295]
[null,296]
[null,297]
[null,298]
[null,299]
[null,300]
[null,301]
[null,302]
[null,303]
[null,304]
[null,305]
[null,306]
[null,307]
[null,308]
[null,309]
[null,310]
[null,311]
[null,312]
[null,313]
[null,314]
[null,315]
[null,316]
[null,317]
[null,318]
[null,319]
[null,320]
[null,321]
[null,{"$f":"1+B324","v":322}]
[null,323]
[null,324]
[null,325]
[null,326]
[null,327]
[null,328]
[null,329]
[null,330]
[null,331]
[null,332]
[null,333]
[null,334]
[null,335]
[null,336]
[null,337]
[null,338]
[null,339]
[null,340]
[null,341]
[null,342]
[null,343]
[null,344]
[null,345]
[null,346]
[null,347]
[null,348]
[null,349]
[null,350]
[null,351]
[null,352]
[null,353]
[null,354]
[null,355]
[null,356]
[null,357]
[null,358]
[null,359]
[null,360]
[null,361]
[null,362]
[null,363]
[null,364]
[null,365]
[null,366]
[null,367]
[null,368]
[null,369]
[null,370]
[null,371]
[null,372]
[null,373]
[null,374]
[null,375]
[null,376]
[null,377]
[null,378]
[null,379]
[null,380]
[null,381]
[null,382]
[null,383]
[null,384]
[null,385]
[null,{"$f":"1+B388","v":386}]
[null,387]
[null,388]
[null,389]
[null,390]
[null,391]
[null,392]
[null,393]
[null,394]
[null,395]
[null,396]
[null,397]
[null,398]
[null,399]
[null,400]
[null,401]
[null,402]
[null,403]
[null,404]
[null,405]
[null,406]
[null,407]
[null,408]
[null,409]
[null,410]
[null,411]
[null,412]
[null,413]
[null,414]
[null,415]
[null,416]
[null,417]
[null,418]
[null,419]
[null,420]
[null,421]
[null,422]
[null,423]
[null,424]
[null,425]
[null,426]
[null,427]
[null,428]
[null,429]
[null,430]
[null,431]
[null,432]
[null,433]
[null,434]
[null,435]
[null,436]
[null,437]
[null,438]
[null,439]
[null,440]
[null,441]
[null,442]
[null,443]
[null,444]
[null,445]
[null,446]
[null,447]
[null,448]
[null,449]
[null,{"$f":"1+B452","v":450}]
[null,451]
[null,452]
[null,453]
[null,454]
[null,455]
[null,456]
[null,457]
[null,458]
[null,459]
[null,460]
[null,461]
[null,462]
[null,463]
[null,464]
[null,465]
[null,466]
[null,467]
[null,468]
[null,469]
[null,470]
[null,471]
[null,472]
[null,473]
[null,474]
[null,475]
[null,476]
[null,477]
[null,478]
[null,479]
[null,480]
[null,481]
[null,482]
[null,483]
[null,484]
[null,485]
[null,486]
[null,487]
[null,488]
[null,489]
[null,490]
[null,491]
[null,492]
[null,493]
[null,494]
[null,495]
[null,496]
[null,497]
[null,498]
[null,499]
[null,500]
[null,501]
[null,502]
[null,503]
[null,504]
[null,505]
[null,506]
[null,507]
[null,508]
[null,509]
[null,510]
[null,511]
[null,512]
[null,513]
[null,{"$f":"1+B516","v":514}]
[null,515]
[null,516]
[null,517]
[null,518]
[null,519]
[null,520]
[null,521]
[null,522]
[null,523]
[null,524]
[null,525]
[null,526]
[null,527]
[null,528]
[null,529]
[null,530]
[null,531]
[null,532]
[null,533]
[null,534]
[null,535]
[null,536]
[null,537]
[null,538]
[null,539]
[null,540]
[null,541]
[null,542]
[null,543]
[null,544]
[null,545]
[null,546]
[null,547]
[null,548]
[null,549]
[null,550]
[null,551]
[null,552]
[null,553]
[null,554]
[null,555]
[null,556]
[null,557]
[null,558]
[null,559]
[null,560]
[null,561]
[null,562]
[null,563]
[null,564]
[null,565]
[null,566]
[null,567]
[null,568]
[null,569]
[null,570]
[null,571]
[null,572]
[null,573]
[null,574]
[null,575]
[null,576]
[null,577]
[null,{"$f":"1+B580","v":578}]
[null,579]
[null,580]
[null,581]
[null,582]
[null,583]
[null,584]
[null,585]
[null,586]
[null,587]
[null,588]
[null,589]
[null,590]
[null,591]
[null,592]
[null,593]
[null,594]
[null,595]
[null,596]
[null,597]
[null,598]
[null,599]
[null,600]
[null,601]
[null,602]
[null,603]
[null,604]
[null,605]
[null,606]
[null,607]
[null,608]
[null,609]
[null,610]
[null,611]
[null,612]
[null,613]
[null,614]
[null,615]
[null,616]
[null,617]
[null,618]
[null,619]
[null,620]
[null,621]
[null,622]
[null,623]
[null,624]
[null,625]
[null,626]
[null,627]
[null,628]
[null,629]
[null,630]
[null,631]
[null,632]
[null,633]
[null,634]
[null,635]
[null,636]
[null,637]
[null,638]
[null,639]
[null,640]
[null,641]
[null,{"$f":"1+B644","v":642}]
[null,643]
[null,644]
[null,645]
[null,646]
[null,647]
[null,648]
[null,649]
[null,650]
[null,651]
[null,652]
[null,653]
[null,654]
[null,655]
[null,656]
[null,657]
[null,658]
[null,659]
[null,660]
[null,661]
[null,662]
[null,663]
[null,664]
[null,665]
[null,666]
[null,667]
[null,668]
[null,669]
[null,670]
[null,671]
[null,672]
[null,673]
[null,674]
[null,675]
[null,676]
[null,677]
[null,678]
[null,679]
[null,680]
[null,681]
[null,682]
[null,683]
[null,684]
[null,685]
[null,686]
[null,687]
[null,688]
[null,689]
[null,690]
[null,691]
[null,692]
[null,693]
[null,694]
[null,695]
[null,696]
[null,697]
[null,698]
[null,699]
[null,700]
[null,701]
[null,702]
[null,703]
[null,704]
[null,705]
[null,{"$f":"1+B708","v":706}]
[null,707]
[null,708]
[null,709]
[null,710]
[null,711]
[null,712]
[null,713]
[null,714]
[null,715]
[null,716]
[null,717]
[null,718]
[null,719]
[null,720]
[null,721]
[null,722]
[null,723]
[null,724]
[null,725]
[null,726]
[null,727]
[null,728]
[null,729]
[null,730]
[null,731]
[null,732]
[null,733]
[null,734]
[null,735]
[null,736]
[null,737]
[null,738]
[null,739]
[null,740]
[null,741]
[null,742]
[null,743]
[null,744]
[null,745]
[null,746]
[null,747]
[null,748]
[null,749]
[null,750]
[null,751]
[null,752]
[null,753]
[null,754]
[null,755]
[null,756]
[null,757]
[null,758]
[null,759]
[null,760]
[null,761]
[null,762]
[null,763]
[null,764]
[null,765]
[null,766]
[null,767]
[null,768]
[null,769]
[null,{"$f":"1+B772","v":770}]
[null,771]
[null,772]
[null,773]
[null,774]
[null,775]
[null,776]
[null,777]
[null,778]
[null,779]
[null,780]
[null,781]
[null,782]
[null,783]
[null,784]
[null,785]
[null,786]
[null,787]
[null,788]
[null,789]
[null,790]
[null,791]
[null,792]
[null,793]
[null,794]
[null,795]
[null,796]
[null,797]
[null,798]
[null,799]
[null,800]
[null,801]
[null,802]
[null,803]
[null,804]
[null,805]
[null,806]
[null,807]
[null,808]
[null,809]
[null,810]
[null,811]
[null,812]
[null,813]
[null,814]
[null,815]
[null,816]
[null,817]
[null,818]
[null,819]
[null,820]
[null,821]
[null,822]
[null,823]
[null,824]
[null,825]
[null,826]
[null,827]
[null,828]
[null,829]
[null,830]
[null,831]
[null,832]
[null,833]
[null,{"$f":"1+B836","v":834}]
[null,835]
[null,836]
[null,837]
[null,838]
[null,839]
[null,840]
[null,841]
[null,842]
[null,843]
[null,844]
[null,845]
[null,846]
[null,847]
[null,848]
[null,849]
[null,850]
[null,851]
[null,852]
[null,853]
[null,854]
[null,855]
[null,856]
[null,857]
[null,858]
[null,859]
[null,860]
[null,861]
[null,862]
[null,863]
[null,864]
[null,865]
[null,866]
[null,867]
[null,868]
[null,869]
[null,870]
[null,871]
[null,872]
[null,873]
[null,874]
[null,875]
[null,876]
[null,877]
[null,878]
[null,879]
[null,880]
[null,881]
[null,882]
[null,883]
[null,884]
[null,885]
[null,886]
[null,887]
[null,888]
[null,889]
[null,890]
[null,891]
[null,892]
[null,893]
[null,894]
[null,895]
[null,896]
[null,897]
[null,{"$f":"1+B900","v":898}]
[null,899]
[null,900]
[null,901]
[null,902]
[null,903]
[null,904]
[null,905]
[null,906]
[null,907]
[null,908]
[null,909]
[null,910]
[null,911]
[null,912]
[null,913]
[null,914]
[null,915]
[null,916]
[null,917]
[null,918]
[null,919]
[null,920]
[null,921]
[null,922]
[null,923]
[null,924]
[null,925]
[null,926]
[null,927]
[null,928]
[null,929]
[null,930]
[null,931]
[null,932]
[null,933]
[null,934]
[null,935]
[null,936]
[null,937]
[null,938]
[null,939]
[null,940]
[null,941]
[null,942]
[null,943]
[null,944]
[null,945]
[null,946]
[null,947]
[null,948]
[null,949]
[null,950]
[null,951]
[null,952]
[null,953]
[null,954]
[null,955]
[null,956]
[null,957]
[null,958]
[null,959]
[null,960]
[null,961]
[null,{"$f":"1+B964","v":962}]
[null,963]
[null,964]
[null,965]
[null,966]
[null,967]
[null,968]
[null,969]
[null,970]
[null,971]
[null,972]
[null,973]
[null,974]
[null,975]
[null,976]
[null,977]
[null,978]
[null,979]
[null,980]
[null,981]
[null,982]
[null,983]
[null,984]
[null,985]
[null,986]
[null,987]
[null,988]
[null,989]
[null,990]
[null,991]
[null,992]
[null,993]
[null,994]
[null,995]
[null,996]
[null,997]
[null,998]
[null,999]

{"sheet":"elenco campi italiani","index":2,"n_rows":906,"n_cols":27,"rows_kept":906,"cut":false,"hidden":false,"merged":[[0,0,0,18],[1,5,1,12],[1,13,1,18],[2,5,2,6],[2,7,2,8],[2,9,2,10],[2,11,2,12],[2,13,2,14],[2,15,2,16],[2,17,2,18]]}
["NB: IN ROSSO I DATI DEI CAMPI AGGIUNTI MANUALMENTE, IN QUANTO NON PRESENTI NEL FILE DELLA FEDERAZIONE",null,null,null,null,null,null,null,null,null,null,null,null,null,null,null,null,null,null,null,"hcp","tee","n. tee","UOMO/DONNA","n. pcc"]
["TOTALE PERCORSI",902,null,null,null,"TEE UOMINI",null,null,null,null,null,null,null,"TEE DONNE",null,null,null,null,null,null,-6,"nero",6,null,-1,"arancio",18]
["Nome esteso","n.","Circolo","Percorso",null,"NERO",null,"BIANCO",null,"GIALLO",null,"VERDE",null,"BLU",null,"ROSSO",null,"ARANCIO",null,null,{"$f":"ROUND(0.1+U2,1)","v":-5.9},"bianco",8,null,0,"bianco",8]
[null,null,null,null,"PAR","CR","Slope","CR","Slope","CR","Slope","CR","Slope","CR","Slope","CR","Slope","CR","Slope",null,{"$f":"ROUND(0.1+U3,1)","v":-5.8},"giallo",10,null,1,"blu",14]
[{"$f":"_xlfn.TEXTJOIN(\" \",TRUE,C5:D5)","v":"ACAYA 18 Buche Par 71"},{"$f":"1+B4","v":1},"ACAYA","18 Buche Par 71",71,null,null,73.900000000000006,136,71.8,130,68.2,122,77.400000000000006,134,73.900000000000006,127,70.900000000000006,121,null,{"$f":"ROUND(0.1+U4,1)","v":-5.7},"verde",12,null,2,"giallo",10]
[{"$f":"_xlfn.TEXTJOIN(\" \",TRUE,C6:D6)","v":"ACAYA 18 Buche Par 72"},2,"ACAYA","18 Buche Par 72",72,null,null,null,null,72.8,133,null,null,null,null,74.900000000000006,131,null,null,null,-5.6,"blu",14,"D",3,"nero",6]
["ACAYA Prime Nove",3,"ACAYA","Prime Nove",36,null,null,null,null,36.4,125,34.299999999999997,116,null,null,37.200000000000003,122,35.700000000000003,116,null,-5.5,"rosso",16,"D",null,"rosso",16]
["ACAYA Seconde Nove Par 35",4,"ACAYA","Seconde Nove Par 35",35,null,null,null,null,35.4,135,33.700000000000003,127,null,null,36.700000000000003,131,35.200000000000003,126,null,-5.4,"arancio",18,"D",null,"verde",12]
["ACAYA Seconde Nove Par 36",5,"ACAYA","Seconde Nove Par 36",36,null,null,null,null,36.4,141,null,null,null,null,37.799999999999997,137,null,null,null,-5.3]
["ACQUABONA 18 Buche",6,"ACQUABONA","18 Buche",68,null,null,null,null,68.3,131,null,null,null,null,70.599999999999994,119,null,null,null,-5.2,"113/SLOPE","PAR DEL CAMPO","CR DEL CAMPO","SR DEL CAMPO","TEE USATO","Tipo gara 9-18 buche"]
["ACQUABONA Nove Buche",7,"ACQUABONA","Nove Buche",34,null,null,null,null,34.1,131,null,null,null,null,35.299999999999997,119,null,null,null,-5.0999999999999996,{"$f":"ROUND(113/Y11,3)","v":0.83699999999999997},{"$f":"VLOOKUP('calcolo handicap'!B3,'elenco campi italiani'!$A$5:$S$906,5)","v":71},{"$f":"VLOOKUP('calcolo handicap'!B3,'elenco campi italiani'!$A$5:$S$906,Z11)","v":70.8},{"$f":"VLOOKUP('calcolo handicap'!B3,'elenco campi italiani'!$A$5:$S$906,Z11+1)","v":135},{"$f":"VLOOKUP('calcolo handicap'!B5,'elenco campi italiani'!$Z$2:$AA$8,2)","v":10},{"$f":"IF('elenco campi italiani'!W11>=40,18,9)","v":18}]
[{"$f":"_xlfn.TEXTJOIN(\" \",TRUE,C12:D12)","v":"ALBARELLA 18 BUCHE"},8,"ALBARELLA","18 BUCHE",72,null,null,72,121,70.5,118,68.2,113,73.8,125,72.5,121,70,116,null,-5]
["ALBISOLA 18 Buche par 64",{"$f":"1+B12","v":9},"ALBISOLA","18 Buche par 64",64,null,null,null,null,62.4,105,60.4,99,null,null,62.8,108,62.8,108,null,-4.9000000000000004,null,"PUNTI STB -36 GARA 18B",null,null,null,"PUNTI STB -18 GARA 9B"]
["ALBISOLA 18 buche par 65",10,"ALBISOLA","18 buche par 65",65,null,null,null,null,62.6,107,60.6,102,null,null,63,109,60.9,105,null,-4.8,null,{"$f":"IF(AA11=9,\"GARA 9 BUCHE\",'calcolo handicap'!B9-36)","v":1},null,null,null,{"$f":"IF('elenco campi italiani'!AA11=9,'calcolo handicap'!B9-18,\"GARA 18 BUCHE\")","v":"GARA 18 BUCHE"}]
["ALBISOLA 18 buche par 66",11,"ALBISOLA","18 buche par 66",66,null,null,null,null,62.8,108,60.8,102,null,null,63.2,110,null,null,null,-4.7,null,"AGS 18BUCHE",null,null,null,"AGS 9BUCHE"]
["ALBISOLA 9 Buche par 32",12,"ALBISOLA","9 Buche par 32",32,null,null,null,null,31.2,105,30.2,99,null,null,31.4,108,null,null,null,-4.5999999999999996,null,{"$f":"IF(AA11=9,\"GARA 9 BUCHE\",ROUND(W11+'calcolo handicap'!D5-W14,0))","v":85},null,null,null,{"$f":"IF(AA11=18,\"GARA 18 BUCHE\",ROUND(2*(W11+'calcolo handicap'!D5)+1-AA14,0))","v":"GARA 18 BUCHE"}]
["ALBISOLA 9 buche par 33",13,"ALBISOLA","9 buche par 33",33,null,null,null,null,31.4,108,30.4,102,null,null,31.6,110,null,null,null,-4.5,null,"SD 18 BUCHE",null,null,null,"SD 9 buche"]
["ALPINO 18 Buche",14,"ALPINO","18 Buche",69,null,null,67.900000000000006,131,66.099999999999994,131,64,126,69.900000000000006,122,68.3,118,65.900000000000006,113,null,-4.4000000000000004,null,{"$f":"IF(AA11=9,\"GARA 9 BUCHE\",+V11*(W16-X11-'calcolo handicap'!B11))","v":11.885400000000002},null,null,null,{"$f":"IF(AA11=18,\"GARA 18 BUCHE\",V11*(AA16-2*X11-'calcolo handicap'!B11/2))","v":"GARA 18 BUCHE"}]
["ALPINO Prime Nove",15,"ALPINO","Prime Nove",35,null,null,34,132,33.1,132,31.9,127,35.1,123,34.299999999999997,118,null,null,null,-4.3]
["ALPINO Seconde Nove",16,"ALPINO","Seconde Nove",34,null,null,33.799999999999997,131,33.1,131,null,null,34.799999999999997,122,34,117,null,null,null,-4.2]
["ALTA BADIA 18 Buche",17,"ALTA BADIA","18 Buche",72,null,null,69.5,129,null,null,null,null,70.400000000000006,133,null,null,null,null,null,-4.0999999999999996]
["ALTA BADIA 9 Buche",18,"ALTA BADIA","9 Buche",36,null,null,34.799999999999997,129,null,null,null,null,35.200000000000003,133,null,null,null,null,null,-4]
["AMBROSIANO 18 Buche",19,"AMBROSIANO","18 Buche",72,null,null,73,133,71.900000000000006,131,67.5,121,75.3,132,73.7,128,71.099999999999994,122,null,-3.9]
["AMBROSIANO Prime Nove",20,"AMBROSIANO","Prime Nove",36,null,null,36.5,133,35.9,131,33.700000000000003,126,37.5,128,36.4,123,35.1,120,null,-3.8]
["AMBROSIANO Seconde Nove",21,"AMBROSIANO","Seconde Nove",36,null,null,36.5,133,36,130,33.9,125,37.799999999999997,135,37.200000000000003,133,35.9,130,null,-3.7]
["ANTOGNOLLA 18 buche",22,"ANTOGNOLLA","18 buche",71,null,null,72.099999999999994,129,70.5,125,66.599999999999994,116,74.099999999999994,125,71.599999999999994,120,67.400000000000006,111,null,-3.6]
["ANTOGNOLLA 9 buche 2019",23,"ANTOGNOLLA","9 buche 2019",35,null,null,null,null,34.799999999999997,128,33,124,null,null,35.4,123,null,null,null,-3.5]
["ANTOGNOLLA prime nove",24,"ANTOGNOLLA","prime nove",36,null,null,null,null,34.9,132,32.9,127,null,null,35.299999999999997,119,null,null,null,-3.4]
["ANTOGNOLLA seconde nove",25,"ANTOGNOLLA","seconde nove",35,null,null,null,null,35.6,118,33.700000000000003,114,null,null,36.299999999999997,120,null,null,null,-3.3]
["AOSTA 18 Buche",26,"AOSTA","18 Buche",62,null,null,null,null,61.1,112,58.6,106,null,null,59.2,107,59.2,107,null,-3.2]
["AOSTA 9 Buche",27,"AOSTA","9 Buche",31,null,null,null,null,30.6,112,29.3,106,null,null,29.6,107,null,null,null,-3.1]
["APPIANO - CAREZZA 18 Buche",28,"APPIANO - CAREZZA","18 Buche",70,null,null,null,null,68.5,126,64.8,117,null,null,70.599999999999994,128,67.599999999999994,122,null,-3]
["APPIANO - CAREZZA 18 buche",29,"APPIANO - CAREZZA","18 buche",70,74.099999999999994,121,72.400000000000006,117,70.2,112,67.400000000000006,106,71.400000000000006,123,68,116,64.8,109,null,-2.9]
["APPIANO - CAREZZA Nove buche",30,"APPIANO - CAREZZA","Nove buche",35,37.1,121,36.200000000000003,117,35.1,112,33.700000000000003,105,35.700000000000003,123,34,116,32.4,109,null,-2.8]
["APPIANO - CAREZZA Nove Buche",31,"APPIANO - CAREZZA","Nove Buche",35,null,null,null,null,34.299999999999997,126,32.4,117,null,null,35.299999999999997,128,33.799999999999997,122,null,-2.7]
["ARCHI CLAUDIO 18 Buche",32,"ARCHI CLAUDIO","18 Buche",66,null,null,null,null,65.900000000000006,112,62.9,105,null,null,66.900000000000006,111,63.8,105,null,-2.6]
["ARCHI CLAUDIO 18 buche par 64",33,"ARCHI CLAUDIO","18 buche par 64",64,null,null,null,null,64.599999999999994,114,61.4,107,null,null,65.400000000000006,113,62.2,107,null,-2.5]
["ARCHI CLAUDIO 9 buche par 32",34,"ARCHI CLAUDIO","9 buche par 32",32,null,null,null,null,32.299999999999997,114,30.7,107,null,null,32.700000000000003,113,31.1,107,null,-2.4]
["ARCHI CLAUDIO Prime Nove",{"$f":"1+B38","v":35},"ARCHI CLAUDIO","Prime Nove",33,null,null,null,null,33,112,31.4,105,null,null,33.5,111,31.9,105,null,-2.2999999999999998]
["ARCHI CLAUDIO US KIDS",36,"ARCHI CLAUDIO","US KIDS",33,null,null,null,null,31.5,106,null,null,null,null,33.5,111,null,null,null,-2.2000000000000002]
["ARENZANO 18 Buche",37,"ARENZANO","18 Buche",72,null,null,null,null,71,133,67.900000000000006,126,null,null,73,133,70.7,128,null,-2.1]
["ARENZANO Nove Buche",38,"ARENZANO","Nove Buche",36,null,null,null,null,35.5,133,34,126,null,null,36.5,133,35.4,128,null,-2]
["ARGENTA 18 Buche",39,"ARGENTA","18 Buche",72,null,null,72.8,126,71.900000000000006,125,68.3,117,74.400000000000006,129,73.599999999999994,128,70.8,122,null,-1.9]
["ARGENTA Prime Nove",40,"ARGENTA","Prime Nove",36,null,null,36.200000000000003,129,35.700000000000003,127,34,123,37.1,129,36.700000000000003,128,35.200000000000003,125,null,-1.8]
["ARGENTA Seconde Nove",41,"ARGENTA","Seconde Nove",36,null,null,36.6,124,36.200000000000003,122,34.200000000000003,117,37.299999999999997,130,36.9,128,35.6,125,null,-1.7]
["ARGENTARIO 18 Buche",42,"ARGENTARIO","18 Buche",71,null,null,74.099999999999994,141,72.400000000000006,138,69.5,131,76.400000000000006,143,72.900000000000006,135,69.900000000000006,129,null,-1.6]
["ARGENTARIO Prime Nove",43,"ARGENTARIO","Prime Nove",36,null,null,36.799999999999997,143,36,141,34.5,138,38.1,144,36.5,137,35,134,null,-1.5]
["ARGENTARIO Seconde Nove",44,"ARGENTARIO","Seconde Nove",35,null,null,37.299999999999997,139,36.4,135,34.9,132,38.299999999999997,141,36.4,134,34.9,131,null,-1.4]
["ARONA 18 buche",45,"ARONA","18 buche",70,null,null,null,null,68.8,129,66,123,null,null,70,125,null,null,null,-1.3]
["ARONA Prime Nove",46,"ARONA","Prime Nove",35,null,null,null,null,34,131,32.5,124,null,null,34.799999999999997,120,null,null,null,-1.2]
["ARZAGA Gary P. 1-9",47,"ARZAGA","Gary P. 1-9",36,null,null,null,null,35,128,33.700000000000003,125,null,null,35.700000000000003,123,34.299999999999997,120,null,-1.1000000000000001]
["ARZAGA Gary Player",48,"ARZAGA","Gary Player",72,null,null,71.8,133,69.900000000000006,128,null,null,72.2,125,71.400000000000006,123,null,null,null,-1]
["ARZAGA GP1 + JN1",49,"ARZAGA","GP1 + JN1",72,null,null,72.5,130,70.900000000000006,125,68.2,119,72.3,124,72.099999999999994,124,69.400000000000006,118,null,-0.9]
["ARZAGA GP1 + JN2",50,"ARZAGA","GP1 + JN2",72,null,null,72.599999999999994,134,70.8,129,67.900000000000006,122,73.5,129,72.099999999999994,127,69.400000000000006,121,null,-0.8]
["ARZAGA Jack N. 1-9",51,"ARZAGA","Jack N. 1-9",36,null,null,null,null,35.9,124,34.5,121,null,null,36.4,125,35,122,null,-0.7]
["ARZAGA Jack Nicklaus",52,"ARZAGA","Jack Nicklaus",72,null,null,73.2,130,71.7,126,68.8,119,73.599999999999994,129,72.8,128,70,122,null,-0.6]
["ASIAGO 18 Buche",53,"ASIAGO","18 Buche",71,null,null,72.5,127,70.2,124,66.400000000000006,115,73.5,127,70.8,124,67.7,117,null,-0.5]
["ASIAGO Prime Nove",54,"ASIAGO","Prime Nove",36,null,null,36.5,128,35.299999999999997,121,33.700000000000003,117,37.299999999999997,128,35.5,125,34.1,122,null,-0.4]
["ASIAGO Seconde Nove",55,"ASIAGO","Seconde Nove",35,null,null,36,125,34.9,126,32.9,121,36.200000000000003,126,35.299999999999997,123,33.6,119,null,-0.3]
["ASOLO Giallo-Giallo",56,"ASOLO","Giallo-Giallo",72,null,null,73.099999999999994,136,71.599999999999994,132,null,null,74.8,131,72.8,127,null,null,null,-0.2]
["ASOLO Giallo-Verde",57,"ASOLO","Giallo-Verde",72,null,null,73.2,137,71.599999999999994,131,68.7,124,75.099999999999994,137,72.8,132,69.2,125,null,-0.1]
["ASOLO Percorso Giallo 9 buche",58,"ASOLO","Percorso Giallo 9 buche",36,null,null,36.5,136,35.799999999999997,132,34.4,126,37.4,131,36.4,127,35.299999999999997,121,null,0]
["ASOLO Percorso Rosso 9 buche",59,"ASOLO","Percorso Rosso 9 buche",36,null,null,36.799999999999997,141,35.799999999999997,137,34.299999999999997,129,37.799999999999997,129,36.700000000000003,122,35.200000000000003,116,null,0.1]
["ASOLO Percorso Verde 9 buche",60,"ASOLO","Percorso Verde 9 buche",36,null,null,36.700000000000003,138,35.700000000000003,133,34.299999999999997,127,37.6,143,36.5,137,34.5,129,null,0.2]
["ASOLO Rosso-Giallo",61,"ASOLO","Rosso-Giallo",72,null,null,73.3,138,71.7,134,68.8,127,75.2,130,73.099999999999994,124,70,118,null,0.3]
["ASOLO Rosso-Verde",62,"ASOLO","Rosso-Verde",72,null,null,73.5,139,71.599999999999994,135,68.7,128,75.400000000000006,137,73.099999999999994,129,69.5,121,null,0.4]
["ASOLO Verde-Rosso",63,"ASOLO","Verde-Rosso",72,null,null,73.5,139,null,null,null,null,75.400000000000006,137,null,null,null,null,null,0.5]
["BAGNAIA 18 Buche",64,"BAGNAIA","18 Buche",71,null,null,73.599999999999994,147,71.2,141,68.8,135,74.900000000000006,141,72.2,135,69.7,130,null,0.6]
["BAGNAIA Prime Nove",{"$f":"1+B68","v":65},"BAGNAIA","Prime Nove",36,null,null,37,153,35.799999999999997,147,34.6,141,37.299999999999997,144,35.9,138,34.6,133,null,{"$f":"ROUND(0.1+U68,1)","v":0.7}]
["BAGNAIA Seconde Nove",66,"BAGNAIA","Seconde Nove",35,null,null,36.6,141,35.4,135,34.200000000000003,129,37.6,138,36.299999999999997,132,35,127,null,0.8]
["BARIALTO 18 Buche",67,"BARIALTO","18 Buche",70,null,null,null,null,70.099999999999994,125,66,116,null,null,70.3,120,66.2,111,null,0.9]
[{"$f":"_xlfn.TEXTJOIN(\" \",TRUE,C72:D72)","v":"BARIALTO Prime Nove"},68,"BARIALTO","Prime Nove",36,null,null,null,null,35.200000000000003,128,33.1,123,null,null,35.299999999999997,120,33.299999999999997,116,null,1]
["BARIALTO Seconde Nove",69,"BARIALTO","Seconde Nove",34,null,null,null,null,34.9,122,33,117,null,null,35,120,32.9,116,null,1.1000000000000001]
["BARLASSINA Campionato",70,"BARLASSINA","Campionato",72,null,null,72.900000000000006,135,71.599999999999994,132,68.8,126,74.3,126,74.099999999999994,126,73.3,124,null,1.2]
["BARLASSINA Prime Nove",71,"BARLASSINA","Prime Nove",36,null,null,35.9,133,35.299999999999997,130,34.200000000000003,125,37,121,36.6,119,36.200000000000003,118,null,1.3]
["BARLASSINA Seconde Nove",72,"BARLASSINA","Seconde Nove",36,null,null,37,138,36.299999999999997,135,null,null,37.299999999999997,132,37.5,131,null,null,null,1.4]
["BELLOSGUARDO monnalisa 70",73,"BELLOSGUARDO","monnalisa 70",70,null,null,null,null,72.400000000000006,128,68.8,120,null,null,72.599999999999994,124,69.400000000000006,118,null,1.5]
["BELLOSGUARDO Monnalisa New",74,"BELLOSGUARDO","Monnalisa New",71,null,null,74.599999999999994,133,72.8,129,69.2,121,76.599999999999994,133,72.900000000000006,125,69.599999999999994,118,null,1.6]
["BELLOSGUARDO Monnalisa New Prime Nove",75,"BELLOSGUARDO","Monnalisa New Prime Nove",36,null,null,null,null,36.299999999999997,129,34.6,121,null,null,36.5,125,34.799999999999997,118,null,1.7]
["BELLOSGUARDO Monnalisa par 35",76,"BELLOSGUARDO","Monnalisa par 35",35,null,null,null,null,35.9,128,34.200000000000003,120,null,null,36.200000000000003,124,34.6,118,null,1.8]
["BERGAMO ALBENZA Blu",77,"BERGAMO ALBENZA","Blu",36,null,null,null,null,35.799999999999997,137,34.700000000000003,132,null,null,36.9,127,36,125,null,1.9]
["BERGAMO ALBENZA Blu-Giallo",78,"BERGAMO ALBENZA","Blu-Giallo",72,null,null,73.099999999999994,137,71.8,136,69.5,131,75.5,133,74.7,131,72.099999999999994,125,null,2]
["BERGAMO ALBENZA Giallo",79,"BERGAMO ALBENZA","Giallo",36,null,null,null,null,36,135,34.799999999999997,129,null,null,37.799999999999997,135,36.1,125,null,2.1]
["BERGAMO ALBENZA Rosso",80,"BERGAMO ALBENZA","Rosso",36,null,null,null,null,35.799999999999997,136,34.700000000000003,131,null,null,36.1,132,35.9,131,null,2.2000000000000002]
["BERGAMO ALBENZA Rosso-Blu",81,"BERGAMO ALBENZA","Rosso-Blu",72,null,null,72.599999999999994,137,70.900000000000006,134,69.400000000000006,132,74.400000000000006,134,73.400000000000006,131,71.900000000000006,128,null,2.2999999999999998]
["BERGAMO ALBENZA Rosso-Giallo",82,"BERGAMO ALBENZA","Rosso-Giallo",72,null,null,72.5,135,71.099999999999994,133,69.5,130,74.599999999999994,135,73.900000000000006,132,72,128,null,2.4]
["BIELLA BETULLE 18 buche 2018",83,"BIELLA BETULLE","18 buche 2018",73,null,null,75,145,72.900000000000006,142,69.599999999999994,134,76.5,138,74.7,131,70.5,122,null,2.5]
["BIELLA BETULLE Le Betulle",84,"BIELLA BETULLE","Le Betulle",73,null,null,74.8,144,72.8,140,69.3,132,76.3,136,74.400000000000006,130,70,121,null,2.6]
["BIELLA BETULLE prime 9",85,"BIELLA BETULLE","prime 9",36,null,null,37.4,146,36.4,138,33.4,124,37.700000000000003,133,37,128,33.6,114,null,2.7]
["BOGLIACO 18 Buche",86,"BOGLIACO","18 Buche",70,null,null,null,null,70.3,141,68.099999999999994,136,null,null,72,134,69.400000000000006,129,null,2.8]
["BOGLIACO Prime Nove",87,"BOGLIACO","Prime Nove",35,null,null,null,null,34.700000000000003,141,33.700000000000003,136,null,null,35.799999999999997,130,35,127,null,2.9]
["BOGLIACO Seconde Nove",88,"BOGLIACO","Seconde Nove",35,null,null,null,null,35.6,140,34.4,134,null,null,36.200000000000003,138,35.299999999999997,134,null,3]
["BOGOGNO 1° Nove - Conte",89,"BOGOGNO","1° Nove - Conte",36,null,null,null,null,35.9,130,34.5,127,null,null,35.700000000000003,126,34.200000000000003,123,null,3.1]
["BOGOGNO 2° Nove - Conte",90,"BOGOGNO","2° Nove - Conte",36,null,null,null,null,35.1,125,33.9,122,null,null,35.9,120,34.4,117,null,3.2]
["BOGOGNO Bonora",91,"BOGOGNO","Bonora",72,null,null,74.400000000000006,140,72.5,136,69.400000000000006,129,74.900000000000006,136,71.7,130,68.8,124,null,3.3]
["BOGOGNO del Conte",92,"BOGOGNO","del Conte",72,null,null,73.2,131,71,128,68.400000000000006,122,74.099999999999994,129,71.599999999999994,123,68.599999999999994,117,null,3.4]
["BOGOGNO Prime Nove - Bonora",93,"BOGOGNO","Prime Nove - Bonora",36,null,null,null,null,35.9,132,34.4,125,null,null,35.799999999999997,130,34.299999999999997,124,null,3.5]
["BOGOGNO Seconde Nove - Bonora",94,"BOGOGNO","Seconde Nove - Bonora",36,null,null,null,null,36.6,140,35,133,null,null,36,130,null,null,null,3.6]
["BOLOGNA 18 Buche",95,"BOLOGNA","18 Buche",72,null,null,72,124,71.7,127,68.8,120,74.3,128,73.7,125,70.8,119,null,3.7]
["BOLOGNA PAR 71 CAMPIONATO",96,"BOLOGNA","PAR 71 CAMPIONATO",71,null,null,72,124,71.3,125,68.400000000000006,119,74.3,128,73.3,124,70.400000000000006,118,null,3.8]
["BOLOGNA par 71.",97,"BOLOGNA","par 71.",71,null,null,71.599999999999994,125,70.900000000000006,126,68,120,73.8,128,72.8,124,69.900000000000006,118,null,3.9]
["BOLOGNA Prime Nove",98,"BOLOGNA","Prime Nove",36,null,null,36,133,35.700000000000003,135,34.4,132,37.200000000000003,135,36.700000000000003,129,35.200000000000003,126,null,4]
["BOLOGNA Seconde Nove",99,"BOLOGNA","Seconde Nove",36,null,null,36.299999999999997,119,36.1,118,34.6,114,37.5,121,37.1,120,35.700000000000003,117,null,4.0999999999999996]
["BOLOGNA seconde nove par 35",100,"BOLOGNA","seconde nove par 35",35,null,null,35.6,117,35.200000000000003,117,33.6,108,36.6,121,36.1,119,34.700000000000003,110,null,4.2]
["BORGO CAMUZZAGO Nove Buche par 27",101,"BORGO CAMUZZAGO","Nove Buche par 27",27,null,null,null,null,28.9,97,28.9,97,null,null,30.7,96,null,null,null,4.3]
["BORGO CAMUZZAGO 18 buche",102,"BORGO CAMUZZAGO","18 buche",64,null,null,null,null,63.4,112,62.1,109,null,null,65,105,null,null,null,4.4000000000000004]
["BORGO CAMUZZAGO 18 Buche - Villa Paradiso",103,"BORGO CAMUZZAGO","18 Buche - Villa Paradiso",72,null,null,74.7,133,72.7,132,70,126,76.599999999999994,137,74.5,131,71.599999999999994,125,null,4.5]
["BORGO CAMUZZAGO 18 Buche par54",104,"BORGO CAMUZZAGO","18 Buche par54",54,null,null,null,null,57.8,97,57.8,97,null,null,61.4,96,null,null,null,4.5999999999999996]
["BORGO CAMUZZAGO 9 buche",105,"BORGO CAMUZZAGO","9 buche",32,null,null,null,null,31.7,112,31.1,109,null,null,32.5,105,null,null,null,4.7]
["BORGO CAMUZZAGO Prime Nove - Villa Paradiso",106,"BORGO CAMUZZAGO","Prime Nove - Villa Paradiso",36,null,null,null,null,36.6,128,35.799999999999997,122,null,null,37.5,131,36.6,125,null,4.8]
["BORGO CAMUZZAGO Seconde Nove - Villa Paradiso",107,"BORGO CAMUZZAGO","Seconde Nove - Villa Paradiso",36,null,null,null,null,36.1,135,34.700000000000003,129,null,null,37,131,35.5,124,null,4.9000000000000004]
["BORMIO 18 Buche",108,"BORMIO","18 Buche",66,null,null,null,null,62.4,111,60.3,106,null,null,63,121,63,121,null,5]
["BORMIO Nove Buche",109,"BORMIO","Nove Buche",33,null,null,null,null,31.2,111,30.1,106,null,null,31.5,121,null,null,null,5.0999999999999996]
["BORMIO provv 18 buche",110,"BORMIO","provv 18 buche",62,null,null,null,null,60.6,112,58.4,107,null,null,60.4,111,null,null,null,5.2]
["BOTANIC SA CUBA 18 buche",111,"BOTANIC SA CUBA","18 buche",70,null,null,null,null,66.2,118,64.7,114,null,null,68.599999999999994,122,68.599999999999994,122,null,5.3]
["BOTANIC SA CUBA 9 buche",112,"BOTANIC SA CUBA","9 buche",35,null,null,null,null,33.1,118,32.4,114,null,null,34.299999999999997,122,null,null,null,5.4]
["BOVES 18 Buche",113,"BOVES","18 Buche",72,null,null,72.2,129,69.2,125,65.599999999999994,117,73.400000000000006,127,70.2,119,67.599999999999994,114,null,5.5]
["BOVES Prime Nove",114,"BOVES","Prime Nove",36,null,null,36,120,34.799999999999997,116,32.9,112,36.6,125,35,116,33.6,113,null,5.6]
["BOVES Seconde Nove",115,"BOVES","Seconde Nove",36,null,null,36.200000000000003,137,34.5,134,32.799999999999997,130,36.799999999999997,129,35.299999999999997,121,34.1,118,null,5.7]
["BRIANZA Brianza",116,"BRIANZA","Brianza",72,null,null,null,null,71.400000000000006,135,69,129,null,null,73.099999999999994,134,70.599999999999994,129,null,5.8]
["BRIANZA Prime Nove",117,"BRIANZA","Prime Nove",35,null,null,null,null,34.6,135,33.5,129,null,null,35.5,133,34.299999999999997,129,null,5.9]
["BRIANZA Seconde Nove",118,"BRIANZA","Seconde Nove",37,null,null,null,null,36.700000000000003,135,35.4,129,null,null,37.5,134,36.200000000000003,129,null,6]
["BUENA VISTA 18 BUCHE",119,"BUENA VISTA","18 BUCHE",60,null,null,null,null,60,101,59.6,100,null,null,60.6,102,null,null,null,6.1]
["BUENA VISTA 9 buche",120,"BUENA VISTA","9 buche",30,null,null,null,null,30,101,29.8,100,null,null,30.3,102,null,null,null,6.2]
["CA' AMATA 18 Buche",121,"CA' AMATA","18 Buche",71,72.3,136,72.2,136,70.599999999999994,132,68.2,126,73.5,136,72.3,133,69.8,128,null,6.3]
["CA' AMATA Prime Nove",122,"CA' AMATA","Prime Nove",36,null,null,36.200000000000003,139,35.4,135,34.200000000000003,129,36.9,139,36.299999999999997,134,35,129,null,6.4]
["CA' AMATA Seconde Nove",123,"CA' AMATA","Seconde Nove",35,36.1,133,36,133,35.200000000000003,129,34,123,36.6,133,36,131,34.799999999999997,126,null,6.5]
["CA' LAURA 9 Buche",124,"CA' LAURA","9 Buche",28,null,null,null,null,29.3,101,null,null,null,null,29.5,93,null,null,null,6.6]
["CA' LAURA old course",125,"CA' LAURA","old course",56,null,null,null,null,58.6,101,58.1,100,null,null,59,93,null,null,null,6.7]
["CA' NAVE 18 Buche",126,"CA' NAVE","18 Buche",72,null,null,73.5,130,72,128,69,121,74.400000000000006,135,73.5,132,70.599999999999994,126,null,6.8]
["CA' NAVE Prime Nove",127,"CA' NAVE","Prime Nove",36,null,null,null,null,36.299999999999997,129,34.799999999999997,122,null,null,37.299999999999997,134,35.799999999999997,128,null,6.9]
["CA' NAVE Seconde Nove",128,"CA' NAVE","Seconde Nove",36,null,null,null,null,35.700000000000003,127,34.200000000000003,120,null,null,36.200000000000003,130,34.700000000000003,124,null,7]
["CA' ULIVI 18 Buche",{"$f":"1+B132","v":129},"CA' ULIVI","18 Buche",72,null,null,71.3,124,70,122,69.099999999999994,120,73.2,122,71.900000000000006,119,null,null,null,{"$f":"ROUND(0.1+U132,1)","v":7.1}]
["CA' ULIVI Mirabello",130,"CA' ULIVI","Mirabello",62,null,null,null,null,62.2,112,60.3,108,null,null,63.4,108,63.4,108,null,7.2]
["CA' ULIVI Mirabello 9 B.",131,"CA' ULIVI","Mirabello 9 B.",31,null,null,null,null,31.1,112,30.1,108,null,null,31.7,108,null,null,null,7.3]
[{"$f":"_xlfn.TEXTJOIN(\" \",TRUE,C136:D136)","v":"CAGLIARI 18 BUCHE 2017"},132,"CAGLIARI","18 BUCHE 2017",72,null,null,null,null,70.599999999999994,126,68.400000000000006,124,null,null,72.400000000000006,134,69.900000000000006,129,null,7.4]
["CAGLIARI 9 BUCHE 2017",133,"CAGLIARI","9 BUCHE 2017",36,null,null,null,null,35.299999999999997,126,34.200000000000003,124,null,null,36.200000000000003,134,34.9,131,null,7.5]
["CAMPODOGLIO 18 buche 2019",134,"CAMPODOGLIO","18 buche 2019",72,null,null,71.599999999999994,123,70,121,65.8,111,73,126,71,120,67.599999999999994,113,null,7.6]
["CAMPODOGLIO 18 buche par 70",135,"CAMPODOGLIO","18 buche par 70",70,null,null,71.400000000000006,123,69.599999999999994,121,65.5,112,72.8,125,70.400000000000006,120,null,null,null,7.7]
["CAMPODOGLIO 18 buche par 71",136,"CAMPODOGLIO","18 buche par 71",71,null,null,71.5,123,69.8,121,null,null,72.900000000000006,126,70.7,120,null,null,null,7.8]
["CAMPODOGLIO par 35 2019",137,"CAMPODOGLIO","par 35 2019",35,null,null,35.700000000000003,123,34.799999999999997,121,32.799999999999997,116,36.4,125,35.200000000000003,120,null,null,null,7.9]
["CAMPODOGLIO par 36 2019",138,"CAMPODOGLIO","par 36 2019",36,null,null,35.799999999999997,123,35,121,33,116,36.5,126,35.5,120,33.799999999999997,116,null,8]
["CANSIGLIO 18 Buche",139,"CANSIGLIO","18 Buche",71,null,null,71.5,133,70,129,66.400000000000006,121,73.5,125,70.900000000000006,119,67,111,null,8.1]
["CANSIGLIO Prime Nove",140,"CANSIGLIO","Prime Nove",35,null,null,null,null,34.200000000000003,126,32.6,122,null,null,34.9,117,32.799999999999997,113,null,8.1999999999999993]
["CANSIGLIO Seconde Nove",141,"CANSIGLIO","Seconde Nove",36,null,null,null,null,35.799999999999997,132,33.9,128,null,null,36,121,34.200000000000003,117,null,8.3000000000000007]
["CAORLE 18 Buche",142,"CAORLE","18 Buche",72,null,null,null,null,71.3,129,68.2,122,null,null,73.5,124,71.8,120,null,8.4]
["CAORLE Prime Nove",143,"CAORLE","Prime Nove",36,null,null,null,null,35.5,130,33.9,123,null,null,36.700000000000003,121,35.799999999999997,118,null,8.5]
["CAORLE Seconde Nove",144,"CAORLE","Seconde Nove",36,null,null,null,null,35.799999999999997,127,34.299999999999997,121,null,null,36.799999999999997,125,36,122,null,8.6]
["CARIMATE 18 Buche",145,"CARIMATE","18 Buche",71,null,null,71,130,69.7,128,67.5,123,72.900000000000006,127,71.2,123,69.599999999999994,120,null,8.6999999999999993]
["CARIMATE Prime Nove",146,"CARIMATE","Prime Nove",36,null,null,35.4,131,34.700000000000003,128,33.9,124,36.4,127,35.6,123,34.700000000000003,119,null,8.8000000000000007]
["CARIMATE Seconde Nove",147,"CARIMATE","Seconde Nove",35,null,null,35.6,131,34.9,128,33.6,122,36.4,127,35.6,123,34.9,121,null,8.9]
["CASALUNGA 18 Buche",148,"CASALUNGA","18 Buche",72,null,null,71.400000000000006,128,70.599999999999994,125,68,119,72.8,123,71.2,117,69,112,null,9]
["CASALUNGA Prime Nove",149,"CASALUNGA","Prime Nove",36,null,null,35.700000000000003,128,35.299999999999997,125,34,119,36.4,123,35.6,118,34.5,112,null,9.1]
["CASALUNGA Seconde Nove",150,"CASALUNGA","Seconde Nove",36,null,null,35.700000000000003,128,35.299999999999997,125,null,null,36.4,123,35.6,118,null,null,null,9.1999999999999993]
["CASENTINO 18 Buche",151,"CASENTINO","18 Buche",72,null,null,null,null,70.599999999999994,123,67.5,116,null,null,73,131,68.5,122,null,9.3000000000000007]
["CASENTINO Nove Buche",152,"CASENTINO","Nove Buche",36,null,null,null,null,35.299999999999997,123,33.700000000000003,116,null,null,36.5,131,34.200000000000003,121,null,9.4]
["CASENTINO Tinzinosa",153,"CASENTINO","Tinzinosa",72,null,null,null,null,70.7,127,67.3,119,null,null,73,132,null,null,null,9.5]
["CASENTINO Tinzinosa 2017",154,"CASENTINO","Tinzinosa 2017",71,null,null,null,null,71,128,68.2,121,null,null,74.099999999999994,132,null,null,null,9.6]
["CASENTINO Tinzinosa prime nove (Panorama)",155,"CASENTINO","Tinzinosa prime nove (Panorama)",36,null,null,null,null,35.4,126,33.9,119,null,null,36.700000000000003,132,null,null,null,9.6999999999999993]
["CASTELCONTURBIA 9 buche Azzurro",156,"CASTELCONTURBIA","9 buche Azzurro",36,null,null,36.799999999999997,142,35.9,138,34,129,37.799999999999997,141,36.6,133,34.700000000000003,125,null,9.8000000000000007]
["CASTELCONTURBIA 9 buche Giallo",157,"CASTELCONTURBIA","9 buche Giallo",36,null,null,36.4,148,35.6,146,33.9,138,37.5,135,36.799999999999997,131,35.6,126,null,9.9]
["CASTELCONTURBIA 9 buche Rosso",158,"CASTELCONTURBIA","9 buche Rosso",36,null,null,37.700000000000003,143,37,141,35.200000000000003,132,38.6,137,37.5,135,36.200000000000003,129,null,10]
["CASTELCONTURBIA Azzurro-Giallo",159,"CASTELCONTURBIA","Azzurro-Giallo",72,null,null,73.2,145,71.5,142,67.900000000000006,134,75.3,138,73.400000000000006,132,69.900000000000006,125,null,10.1]
["CASTELCONTURBIA Azzurro-Rosso",160,"CASTELCONTURBIA","Azzurro-Rosso",72,null,null,74.5,143,73,139,69.2,130,76.5,139,74.099999999999994,134,70.599999999999994,127,null,10.199999999999999]
["CASTELCONTURBIA Giallo-Rosso",161,"CASTELCONTURBIA","Giallo-Rosso",72,null,null,74.099999999999994,146,72.599999999999994,143,69.099999999999994,135,76.2,136,74.3,134,71.5,128,null,10.3]
["CASTELFALFI LAKE + Mountain Prime Nove",162,"CASTELFALFI","LAKE + Mountain Prime Nove",73,null,null,null,null,73.8,145,null,null,null,null,76.2,140,null,null,null,10.4]
["CASTELFALFI LAKE + Mountain Seconde Nove",163,"CASTELFALFI","LAKE + Mountain Seconde Nove",73,null,null,null,null,73.099999999999994,151,null,null,null,null,75.8,147,null,null,null,10.5]
["CASTELFALFI LAKE 9 Buche",164,"CASTELFALFI","LAKE 9 Buche",37,null,null,37.200000000000003,152,35.9,144,null,null,39.1,152,37.799999999999997,146,null,null,null,10.6]
["CASTELFALFI Mountain 18 Buche",165,"CASTELFALFI","Mountain 18 Buche",72,null,null,75.599999999999994,151,75.099999999999994,150,71.900000000000006,142,77.8,144,76.400000000000006,141,73.2,134,null,10.7]
["CASTELFALFI Prime Nove Mountain",166,"CASTELFALFI","Prime Nove Mountain",36,null,null,null,null,37.9,144,null,null,null,null,38.4,134,null,null,null,10.8]
["CASTELFALFI Seconde Nove Mountain",167,"CASTELFALFI","Seconde Nove Mountain",36,null,null,null,null,37.200000000000003,155,null,null,null,null,38,148,null,null,null,10.9]
["CASTELGANDOLFO Campionato",168,"CASTELGANDOLFO","Campionato",72,null,null,73.3,137,71.5,134,69.3,129,76.099999999999994,135,73.400000000000006,130,71,125,null,11]
["CASTELGANDOLFO Prime Nove",169,"CASTELGANDOLFO","Prime Nove",36,null,null,36.4,140,35.6,138,34.5,133,38,134,36.700000000000003,130,35.4,125,null,11.1]
["CASTELGANDOLFO PRIME NOVE X2",170,"CASTELGANDOLFO","PRIME NOVE X2",72,null,null,72.8,140,71.2,138,69.099999999999994,133,76,134,73.400000000000006,130,70.8,125,null,11.2]
["CASTELGANDOLFO provv 2019",171,"CASTELGANDOLFO","provv 2019",71,null,null,72.2,134,70,128,67.900000000000006,123,74.900000000000006,133,71.8,125,69.5,120,null,11.3]
["CASTELGANDOLFO Seconde Nove",172,"CASTELGANDOLFO","Seconde Nove",36,null,null,36.9,134,35.9,129,34.799999999999997,124,38.1,134,36.700000000000003,129,35.6,125,null,11.4]
["CASTELGANDOLFO SECONDE NOVE X 2",173,"CASTELGANDOLFO","SECONDE NOVE X 2",72,null,null,73.8,134,71.7,129,69.599999999999994,124,76.2,134,73.400000000000006,129,71.2,125,null,11.5]
["CASTELLARO 18 Buche",174,"CASTELLARO","18 Buche",66,null,null,null,null,65.8,115,63.8,110,null,null,67.3,116,67.3,116,null,11.6]
["CASTELLARO Par 62",175,"CASTELLARO","Par 62",62,null,null,null,null,64.2,111,null,null,null,null,65.599999999999994,112,null,null,null,11.7]
["CASTELLARO Prime 9(62)",176,"CASTELLARO","Prime 9(62)",31,null,null,null,null,32.1,111,null,null,null,null,32.799999999999997,112,null,null,null,11.8]
["CASTELLARO Prime Nove",177,"CASTELLARO","Prime Nove",33,null,null,null,null,32.9,115,31.9,110,null,null,33.700000000000003,116,null,null,null,11.9]
["CASTELLARO Seconde 9(62)",178,"CASTELLARO","Seconde 9(62)",31,null,null,null,null,32.1,111,null,null,null,null,32.799999999999997,112,null,null,null,12]
["CASTELLARO Seconde Nove",179,"CASTELLARO","Seconde Nove",33,null,null,null,null,32.9,115,null,null,null,null,33.700000000000003,116,null,null,null,12.1]
["CASTELL'ARQUATO 18 Buche",180,"CASTELL'ARQUATO","18 Buche",73,null,null,null,null,71.8,124,68.7,117,null,null,72.900000000000006,129,69.900000000000006,123,null,12.2]
["CASTELL'ARQUATO 2 volte Seconde Nove",181,"CASTELL'ARQUATO","2 volte Seconde Nove",74,null,null,null,null,73.2,129,70,122,null,null,74.2,135,71.2,129,null,12.3]
["CASTELL'ARQUATO Prime Nove",182,"CASTELL'ARQUATO","Prime Nove",36,null,null,null,null,35.200000000000003,119,33.700000000000003,112,null,null,35.799999999999997,124,34.299999999999997,118,null,12.4]
["CASTELL'ARQUATO Seconde Nove",183,"CASTELL'ARQUATO","Seconde Nove",37,null,null,null,null,36.6,129,35,122,null,null,37.1,135,35.6,129,null,12.5]
["CASTELLO SPESSA 18 Buche",184,"CASTELLO SPESSA","18 Buche",71,null,null,null,null,69.400000000000006,133,67.2,128,null,null,72.599999999999994,127,68.099999999999994,118,null,12.6]
["CASTELLO SPESSA 2 Volte 1°Nove",185,"CASTELLO SPESSA","2 Volte 1°Nove",70,null,null,null,null,68.400000000000006,128,66.400000000000006,123,null,null,71.599999999999994,124,null,null,null,12.7]
["CASTELLO SPESSA Prime Nove",186,"CASTELLO SPESSA","Prime Nove",35,null,null,null,null,34.200000000000003,128,33.200000000000003,123,null,null,35.799999999999997,124,null,null,null,12.8]
["CASTELLO SPESSA Seconde Nove",187,"CASTELLO SPESSA","Seconde Nove",36,null,null,null,null,35.4,132,34.200000000000003,126,null,null,36.700000000000003,127,null,null,null,12.9]
["CASTELLO TOLCINASCO Blu-Giallo",188,"CASTELLO TOLCINASCO","Blu-Giallo",72,null,null,73.099999999999994,138,71.099999999999994,133,68,126,74.900000000000006,131,71.599999999999994,121,68.099999999999994,114,null,13]
["CASTELLO TOLCINASCO Giallo-Rosso",189,"CASTELLO TOLCINASCO","Giallo-Rosso",72,null,null,73.5,138,71.5,133,68.7,127,75.599999999999994,133,72.599999999999994,124,69.7,118,null,13.1]
["CASTELLO TOLCINASCO Prime Nove (Giallo)",190,"CASTELLO TOLCINASCO","Prime Nove (Giallo)",36,null,null,36.700000000000003,142,35.5,134,34,131,38,132,35.9,120,34,116,null,13.2]
["CASTELLO TOLCINASCO Rosso-Blu",191,"CASTELLO TOLCINASCO","Rosso-Blu",72,null,null,73.2,135,71.5,132,68.7,125,74.599999999999994,131,72.3,125,69.099999999999994,118,null,13.3]
["CASTELLO TOLCINASCO Seconde Nove (Blu)",192,"CASTELLO TOLCINASCO","Seconde Nove (Blu)",36,null,null,36.9,135,36,131,34.5,127,37.700000000000003,133,36.6,129,35,126,null,13.4]
["CASTELLO TOLCINASCO Terze Nove (Rosso)",{"$f":"1+B196","v":193},"CASTELLO TOLCINASCO","Terze Nove (Rosso)",36,null,null,36.799999999999997,134,36,132,34.700000000000003,129,37.6,134,36.6,129,35.1,126,null,{"$f":"ROUND(0.1+U196,1)","v":13.5}]
["CAVAGLIA' 18 buche",194,"CAVAGLIA'","18 buche",68,null,null,null,null,66.2,129,63.8,123,null,null,67.900000000000006,121,65.5,116,null,13.6]
["CAVAGLIA' 9 buche",195,"CAVAGLIA'","9 buche",35,null,null,null,null,33.700000000000003,130,32.6,124,null,null,34.6,120,33.299999999999997,114,null,13.7]
[{"$f":"_xlfn.TEXTJOIN(\" \",TRUE,C200:D200)","v":"CAVAGLIA' 9 buche 1-9"},196,"CAVAGLIA'","9 buche 1-9",34,null,null,null,null,32.9,127,31.8,121,null,null,33.700000000000003,120,32.4,114,null,13.8]
["CENTO 18 Buche",197,"CENTO","18 Buche",54,null,null,null,null,54.7,91,53.2,88,null,null,57.1,87,57.1,87,null,13.9]
["CENTO Prime Nove",198,"CENTO","Prime Nove",27,null,null,null,null,27.4,91,26.6,88,null,null,28.6,87,null,null,null,14]
["CERVIA 9 Buche Blu",199,"CERVIA","9 Buche Blu",36,null,null,35.9,130,35.200000000000003,125,34.200000000000003,120,null,null,35.5,121,34.6,117,null,14.1]
["CERVIA 9 buche Giallo",200,"CERVIA","9 buche Giallo",35,null,null,null,null,35.200000000000003,124,33.9,118,null,null,35.6,120,34.5,116,null,14.2]
["CERVIA 9 Buche Rosso",201,"CERVIA","9 Buche Rosso",36,null,null,36.9,128,36.4,126,34.9,119,null,null,37,120,35.799999999999997,115,null,14.3]
["CERVIA Blu-Giallo",202,"CERVIA","Blu-Giallo",71,null,null,72.3,132,70.5,124,68.2,119,73.5,126,71.099999999999994,121,69.099999999999994,117,null,14.4]
["CERVIA Rosso-Blu",203,"CERVIA","Rosso-Blu",72,null,null,72.900000000000006,129,71.7,125,69.099999999999994,119,74.7,125,72.5,120,70.400000000000006,116,null,14.5]
["CERVIA Rosso-Giallo",204,"CERVIA","Rosso-Giallo",71,null,null,73.3,131,71.599999999999994,125,68.7,118,74.599999999999994,124,72.599999999999994,120,70.3,116,null,14.6]
["CERVINO 18 Buche",205,"CERVINO","18 Buche",69,null,null,68.7,129,68,128,65.900000000000006,123,70.400000000000006,130,69.900000000000006,128,67.099999999999994,122,null,14.7]
["CERVINO 9 Buche",206,"CERVINO","9 Buche",68,null,null,null,null,65,112,null,null,null,null,66.5,114,null,null,null,14.8]
["CHERASCO 18 Buche",207,"CHERASCO","18 Buche",72,null,null,71.7,132,70.8,131,68.400000000000006,125,74.3,130,73.2,128,70.599999999999994,123,null,14.9]
["CHERASCO Prime Nove",208,"CHERASCO","Prime Nove",36,null,null,36.6,133,36.1,130,34.799999999999997,127,37.799999999999997,131,37.200000000000003,129,35.9,126,null,15]
["CHERASCO Prime Nove 2 volte",209,"CHERASCO","Prime Nove 2 volte",72,null,null,73.2,133,72.2,130,69.599999999999994,127,75.599999999999994,131,74.400000000000006,129,71.8,126,null,15.1]
["CHERASCO Seconde Nove",210,"CHERASCO","Seconde Nove",36,null,null,35.1,131,34.700000000000003,131,33.6,128,36.5,129,36,127,34.700000000000003,124,null,15.2]
["CILIEGI Cherries",211,"CILIEGI","Cherries",68,null,null,null,null,65.2,117,null,null,null,null,67.099999999999994,112,null,null,null,15.3]
["CILIEGI Cherries 1 Nove",212,"CILIEGI","Cherries 1 Nove",34,null,null,null,null,32.5,116,null,null,null,null,33.5,112,null,null,null,15.4]
["CILIEGI Cherries 2 Nove",213,"CILIEGI","Cherries 2 Nove",34,null,null,null,null,32.700000000000003,117,null,null,null,null,33.6,112,null,null,null,15.5]
["CILIEGI I Ciliegi",214,"CILIEGI","I Ciliegi",72,null,null,71.7,138,70.2,128,68.2,123,73.900000000000006,128,71.900000000000006,125,69.5,120,null,15.6]
["CILIEGI Prime Nove",215,"CILIEGI","Prime Nove",36,null,null,35.799999999999997,138,35,128,34,123,36.9,128,35.9,125,34.700000000000003,120,null,15.7]
["CILIEGI Seconde Nove",216,"CILIEGI","Seconde Nove",36,null,null,36,139,35.200000000000003,129,34.200000000000003,124,37.1,129,36,125,34.799999999999997,120,null,15.8]
["CITTA' D'ASTI 18 Buche",217,"CITTA' D'ASTI","18 Buche",66,null,null,null,null,65,110,62.8,105,null,null,66.2,111,63.6,106,null,15.9]
["CITTA' D'ASTI Prime Nove",218,"CITTA' D'ASTI","Prime Nove",33,null,null,null,null,32.5,110,31.4,107,null,null,33.1,111,31.8,108,null,16]
["CLAVIERE 18 Buche",219,"CLAVIERE","18 Buche",64,null,null,65.7,116,64.900000000000006,118,63.3,114,67.099999999999994,126,65.900000000000006,124,65.900000000000006,124,null,16.100000000000001]
["CLAVIERE Claviere-Montg.",220,"CLAVIERE","Claviere-Montg.",68,null,null,69.400000000000006,124,67.900000000000006,120,null,null,69.3,117,68.7,116,null,null,null,16.2]
["CLAVIERE Nove Buche",221,"CLAVIERE","Nove Buche",32,null,null,null,null,32.5,118,31.6,114,null,null,33,124,null,null,null,16.3]
["COLLI BERGAMO 18 buche",222,"COLLI BERGAMO","18 buche",60,null,null,null,null,62,113,61.1,111,null,null,61.8,107,null,null,null,16.399999999999999]
["COLLI BERGAMO 9 buche",223,"COLLI BERGAMO","9 buche",30,null,null,null,null,31,113,30.6,111,null,null,30.9,107,null,null,null,16.5]
["COLLI BERICI 18 Buche",224,"COLLI BERICI","18 Buche",70,null,null,70.8,134,69.7,131,67.2,125,73.2,126,71.599999999999994,123,68.3,116,null,16.600000000000001]
["COLLI BERICI Due volte le Seconde Nove",225,"COLLI BERICI","Due volte le Seconde Nove",68,null,null,null,null,67.2,131,64.8,125,null,null,69,123,65.8,116,null,16.7]
["COLLI BERICI Prime Nove",226,"COLLI BERICI","Prime Nove",36,null,null,null,null,36.4,130,35.1,124,null,null,37.1,123,35.5,116,null,16.8]
["COLLI BERICI prime nove 2 volte",227,"COLLI BERICI","prime nove 2 volte",72,null,null,null,null,72.8,130,70.2,124,null,null,74.2,123,71,116,null,16.899999999999999]
["COLLI BERICI Seconde Nove",228,"COLLI BERICI","Seconde Nove",34,null,null,null,null,33.6,131,32.4,125,null,null,34.5,123,32.9,116,null,17]
["COLLINE GAVI 18 Buche 2020",229,"COLLINE GAVI","18 Buche 2020",72,null,null,74.3,139,72.7,135,70.099999999999994,129,77.3,140,74.8,135,72.400000000000006,130,null,17.100000000000001]
["COLLINE GAVI 18 Buche par 73",230,"COLLINE GAVI","18 Buche par 73",73,null,null,74.2,139,73.2,136,70.5,130,77.3,140,75.400000000000006,136,72.8,131,null,17.2]
["COLLINE GAVI 2 volte prime nove 2020",231,"COLLINE GAVI","2 volte prime nove 2020",72,null,null,null,null,72.599999999999994,138,null,null,null,null,74.400000000000006,139,null,null,null,17.3]
["COLLINE GAVI Executive 9 Buche",232,"COLLINE GAVI","Executive 9 Buche",31,null,null,null,null,30.6,113,30.2,111,null,null,31.2,102,null,null,null,17.399999999999999]
["COLLINE GAVI Prime Nove 2020",233,"COLLINE GAVI","Prime Nove 2020",36,null,null,37.299999999999997,142,36.299999999999997,138,35.1,132,null,null,37.200000000000003,139,36.1,134,null,17.5]
["COLLINE GAVI Seconde Nove",234,"COLLINE GAVI","Seconde Nove",36,null,null,37,135,36.4,133,35.1,127,null,null,37.6,132,36.299999999999997,127,null,17.600000000000001]
["COLOMBARO 18 Buche",235,"COLOMBARO","18 Buche",58,null,null,null,null,57.8,98,56.2,94,null,null,55.7,85,55.7,85,null,17.7]
["COLOMBARO Prime Nove",236,"COLOMBARO","Prime Nove",29,null,null,null,null,28.9,99,28.1,95,null,null,27.8,85,null,null,null,17.8]
["COLOMBARO Seconde Nove",237,"COLOMBARO","Seconde Nove",29,null,null,null,null,28.9,99,null,null,null,null,27.8,85,null,null,null,17.899999999999999]
["COLOMBERA AZZURRO",238,"COLOMBERA","AZZURRO",34,null,null,null,null,32.299999999999997,113,30.6,108,null,null,32.9,116,null,null,null,18]
["COLOMBERA NEW (ROSA/AZZURRO)",239,"COLOMBERA","NEW (ROSA/AZZURRO)",67,null,null,65,119,64.3,114,60.8,106,66.8,117,65.5,116,null,null,null,18.100000000000001]
["COLOMBERA OLD (VIOLA/ROSA)",240,"COLOMBERA","OLD (VIOLA/ROSA)",66,null,null,64.5,117,63.8,112,60.3,104,66,116,64.7,115,null,null,null,18.2]
["COLOMBERA ROSA",241,"COLOMBERA","ROSA",33,null,null,null,null,32,114,30.2,104,null,null,32.6,115,null,null,null,18.3]
["COLOMBERA VIOLA",242,"COLOMBERA","VIOLA",33,null,null,null,null,31.8,110,30.1,105,null,null,32.1,113,null,null,null,18.399999999999999]
["CONERO 18 Buche",243,"CONERO","18 Buche",71,null,null,71.400000000000006,131,70.2,129,67.5,123,74.400000000000006,127,73.3,125,70.400000000000006,119,null,18.5]
["CONERO Prime Nove",244,"CONERO","Prime Nove",35,null,null,null,null,34.9,132,33.5,126,null,null,36.299999999999997,126,null,null,null,18.600000000000001]
["CONERO Seconde Nove",245,"CONERO","Seconde Nove",36,null,null,null,null,35.4,126,34,120,null,null,37,123,null,null,null,18.7]
["CONTINENTAL VERBANIA 18 buche Mergozzo+Executive",246,"CONTINENTAL VERBANIA","18 buche Mergozzo+Executive",61,null,null,58.1,106,57.4,104,55.1,99,58.5,100,57.6,98,null,null,null,18.8]
["CONTINENTAL VERBANIA MERGOZZO",247,"CONTINENTAL VERBANIA","MERGOZZO",34,null,null,32.6,122,31.9,118,30.2,114,32.9,115,32,112,null,null,null,18.899999999999999]
["CONTINENTAL VERBANIA Mergozzo 18 Buche",248,"CONTINENTAL VERBANIA","Mergozzo 18 Buche",68,null,null,65.2,122,63.8,118,60.5,110,65.8,115,64,112,null,null,null,19]
["CONTINENTAL VERBANIA prime 9 misto",249,"CONTINENTAL VERBANIA","prime 9 misto",31,null,null,null,null,29.1,103,28,100,null,null,29.6,101,null,null,null,19.100000000000001]
["CONTINENTAL VERBANIA seconde 9 misto",250,"CONTINENTAL VERBANIA","seconde 9 misto",30,null,null,null,null,29,109,27.1,100,null,null,28.8,99,null,null,null,19.2]
["CORTINA 18 Buche",251,"CORTINA","18 Buche",70,null,null,69.8,125,68.2,124,66.400000000000006,120,71.2,120,69.400000000000006,114,68.5,112,null,19.3]
["CORTINA 18 Buche Misto",252,"CORTINA","18 Buche Misto",70,null,null,null,null,68.900000000000006,125,66.400000000000006,120,null,null,70.3,116,68.599999999999994,112,null,19.399999999999999]
["CORTINA 9 Buche",253,"CORTINA","9 Buche",35,null,null,34.9,125,34.1,124,33.200000000000003,120,35.6,120,34.700000000000003,114,34.299999999999997,112,null,19.5]
["COSMOPOLITAN 1° Nove 2 volte",254,"COSMOPOLITAN","1° Nove 2 volte",72,null,null,null,null,72.8,131,69.2,123,null,null,74.8,131,null,null,null,19.600000000000001]
["COSMOPOLITAN 18 Buche",255,"COSMOPOLITAN","18 Buche",72,null,null,73.400000000000006,134,72,133,70.5,130,74.8,136,73.8,133,72.2,130,null,19.7]
["COSMOPOLITAN 2° Nove 2 volte",256,"COSMOPOLITAN","2° Nove 2 volte",72,null,null,null,null,71.2,135,67.400000000000006,126,null,null,72.8,135,null,null,null,19.8]
["COSMOPOLITAN b.12 chiusa 71",{"$f":"1+B260","v":257},"COSMOPOLITAN","b.12 chiusa 71",71,null,null,null,null,70.8,130,67.3,122,null,null,72.5,130,null,null,null,{"$f":"ROUND(0.1+U260,1)","v":19.899999999999999}]
["COSMOPOLITAN misto",258,"COSMOPOLITAN","misto",72,null,null,null,null,72.900000000000006,127,69.099999999999994,118,null,null,75.7,133,null,null,null,20]
["COSMOPOLITAN Prime Nove",259,"COSMOPOLITAN","Prime Nove",36,null,null,null,null,36.4,131,35.6,127,null,null,37.4,131,36.5,127,null,20.100000000000001]
["COSMOPOLITAN Seconde Nove",260,"COSMOPOLITAN","Seconde Nove",36,null,null,null,null,35.6,135,35,132,null,null,36.4,135,35.799999999999997,132,null,20.2]
["COURMAYEUR 18 Buche Par 70 Standard",261,"COURMAYEUR","18 Buche Par 70 Standard",70,null,null,null,null,69,122,66.400000000000006,116,null,null,69.7,125,67.3,120,null,20.3]
[{"$f":"_xlfn.TEXTJOIN(\" \",TRUE,C266:D266)","v":"COURMAYEUR Prime Nove 2015"},262,"COURMAYEUR","Prime Nove 2015",35,null,null,null,null,34.700000000000003,122,33.200000000000003,118,null,null,35.1,126,33.700000000000003,123,null,20.399999999999999]
["COURMAYEUR Seconde Nove 2015",263,"COURMAYEUR","Seconde Nove 2015",35,null,null,null,null,34.299999999999997,121,33.200000000000003,119,null,null,34.6,124,33.4,121,null,20.5]
["CREMA D.10-18+Mummy",264,"CREMA","D.10-18+Mummy",72,null,null,null,null,70.099999999999994,126,67.7,122,null,null,70.5,126,null,null,null,20.6]
["CREMA D.1-9+Mummy",265,"CREMA","D.1-9+Mummy",71,null,null,null,null,68.900000000000006,125,66.5,118,null,null,69.8,123,null,null,null,20.7]
["CREMA Daddy",266,"CREMA","Daddy",73,null,null,74.8,135,72.8,131,70.3,125,76.8,135,73.5,130,71.599999999999994,126,null,20.8]
["CREMA daddy",267,"CREMA","daddy",73,null,null,74.8,135,72.8,131,null,null,76.8,135,73.5,130,73.5,130,null,20.9]
["CREMA Mummy 18",268,"CREMA","Mummy 18",70,null,null,null,null,66.2,120,63.9,115,null,null,66.8,119,null,null,null,21]
["CREMA Mummy 9",269,"CREMA","Mummy 9",35,null,null,null,null,33.1,120,31.9,115,null,null,33.4,119,null,null,null,21.1]
["CREMA Prime Nove",270,"CREMA","Prime Nove",36,null,null,36.9,131,35.799999999999997,129,34.6,126,38,132,36.4,126,34.700000000000003,123,null,21.2]
["CREMA Seconde Nove",271,"CREMA","Seconde Nove",37,null,null,38,139,37,133,35.799999999999997,129,38.9,137,37.1,133,null,null,null,21.3]
["CROARA 18 Buche",272,"CROARA","18 Buche",72,null,null,null,null,71.5,132,68.7,126,null,null,73.900000000000006,130,70.5,123,null,21.4]
["CROARA 18 buche provv. B-17 Par 3",273,"CROARA","18 buche provv. B-17 Par 3",70,null,null,null,null,69.900000000000006,128,66.599999999999994,120,null,null,72.099999999999994,126,null,null,null,21.5]
["CROARA Prime Nove",274,"CROARA","Prime Nove",36,null,null,null,null,36.1,131,34.700000000000003,124,null,null,36.799999999999997,126,35.1,119,null,21.6]
["CROARA Provvisorio 18 buche\n(1-2-3-4-5-6-7-13-18)",275,"CROARA","Provvisorio 18 buche\n(1-2-3-4-5-6-7-13-18)",72,null,null,null,null,71,124,67.900000000000006,117,null,null,73,125,null,null,null,21.7]
["CROARA Provvisorio 18 buche Par 68",276,"CROARA","Provvisorio 18 buche Par 68",68,null,null,null,null,66.900000000000006,121,null,null,null,null,69,120,null,null,null,21.8]
["CROARA Provvisorio 9 buche\n(1-2-3-4-5-6-7-13-18)",277,"CROARA","Provvisorio 9 buche\n(1-2-3-4-5-6-7-13-18)",36,null,null,null,null,35.5,124,34,117,null,null,36.5,125,null,null,null,21.9]
["CROARA Seconde Nove",278,"CROARA","Seconde Nove",36,null,null,null,null,35.4,133,34,127,null,null,37.1,134,35.4,127,null,22]
["CUS FERRARA 18 Buche",279,"CUS FERRARA","18 Buche",68,null,null,null,null,67.8,116,65.2,110,null,null,68.900000000000006,111,66.3,106,null,22.1]
["CUS FERRARA 9 Buche OLD Course",280,"CUS FERRARA","9 Buche OLD Course",33,null,null,null,null,32.799999999999997,112,31.4,109,null,null,33.5,107,32.4,105,null,22.2]
["CUS FERRARA Prime Nove",281,"CUS FERRARA","Prime Nove",34,null,null,null,null,33.200000000000003,122,31.9,119,null,null,33.700000000000003,109,32.5,107,null,22.3]
["CUS FERRARA Seconde Nove",282,"CUS FERRARA","Seconde Nove",34,null,null,null,null,34.5,111,33.299999999999997,108,null,null,35.200000000000003,112,33.799999999999997,109,null,22.4]
["DES ILES BORROMEES 18 Buche",283,"DES ILES BORROMEES","18 Buche",72,null,null,72.2,135,70.5,132,67.400000000000006,125,73.900000000000006,131,72.400000000000006,129,68.8,122,null,22.5]
["DES ILES BORROMEES Prime Nove",284,"DES ILES BORROMEES","Prime Nove",36,null,null,36.1,132,35.5,128,33.9,124,36.9,132,36.5,131,34.4,127,null,22.6]
["DES ILES BORROMEES Seconde Nove",285,"DES ILES BORROMEES","Seconde Nove",36,null,null,36.1,138,35,135,33.4,131,37,130,35.9,128,34.5,125,null,22.7]
["DOLOMITI 18 Buche",286,"DOLOMITI","18 Buche",73,null,null,72.7,130,71.599999999999994,127,68.900000000000006,121,75.8,138,73.400000000000006,132,70.7,126,null,22.8]
["DOLOMITI 2 volte le seconde nove",287,"DOLOMITI","2 volte le seconde nove",72,null,null,null,null,70.599999999999994,122,67.2,114,null,null,72.599999999999994,126,69.8,118,null,22.9]
["DOLOMITI Prime Nove",288,"DOLOMITI","Prime Nove",37,null,null,null,null,36.200000000000003,135,34.700000000000003,132,null,null,37,138,35.5,135,null,23]
["DOLOMITI Seconde Nove",289,"DOLOMITI","Seconde Nove",36,null,null,null,null,35.299999999999997,122,33.6,114,null,null,36.299999999999997,126,34.9,118,null,23.1]
["DRUENTO 18 buche 2020",290,"DRUENTO","18 buche 2020",71,null,null,null,null,68.8,127,66,121,null,null,69.3,127,67.7,123,null,23.2]
["DRUENTO 9 buche 2020",291,"DRUENTO","9 buche 2020",36,null,null,null,null,34.6,130,33.5,127,null,null,34.9,127,34.1,125,null,23.3]
["DUCATO - LA ROCCA 18 Buche",292,"DUCATO - LA ROCCA","18 Buche",72,null,null,73.400000000000006,134,72.5,133,67.900000000000006,122,75.7,129,73.599999999999994,126,69.8,118,null,23.4]
["DUCATO - LA ROCCA Prime Nove",293,"DUCATO - LA ROCCA","Prime Nove",37,null,null,37.5,139,37.200000000000003,138,35,128,38.799999999999997,133,37.9,131,35.9,122,null,23.5]
["DUCATO - LA ROCCA Seconde Nove",294,"DUCATO - LA ROCCA","Seconde Nove",35,null,null,35.9,128,35.299999999999997,127,33.799999999999997,124,36.9,125,35.700000000000003,125,34.299999999999997,122,null,23.6]
["FAENZA CICOGNE 18 Buche",295,"FAENZA CICOGNE","18 Buche",70,null,null,null,null,68.599999999999994,119,67.400000000000006,116,null,null,71.2,117,70,114,null,23.7]
["FAENZA CICOGNE 9 buche",296,"FAENZA CICOGNE","9 buche",35,null,null,null,null,34.299999999999997,119,33.700000000000003,116,null,null,35.6,117,35,114,null,23.8]
["FIORANELLO 18 Buche",297,"FIORANELLO","18 Buche",70,null,null,null,null,69.900000000000006,129,67.900000000000006,124,null,null,73.099999999999994,130,70.7,125,null,23.9]
["FIORANELLO Prime Nove",298,"FIORANELLO","Prime Nove",34,null,null,null,null,34.299999999999997,126,33.299999999999997,121,null,null,35.799999999999997,126,34.700000000000003,121,null,24]
["FIORANELLO Seconde Nove",299,"FIORANELLO","Seconde Nove",36,null,null,null,null,35.6,132,34.6,127,null,null,37.299999999999997,134,36,129,null,24.1]
["FIRENZE UGOLINO 18 Buche",300,"FIRENZE UGOLINO","18 Buche",72,null,null,null,null,70.900000000000006,133,67.5,125,null,null,72.400000000000006,126,69.2,119,null,24.2]
["FIRENZE UGOLINO Prime Nove",301,"FIRENZE UGOLINO","Prime Nove",36,null,null,null,null,35.200000000000003,133,33.799999999999997,130,null,null,36.200000000000003,132,34.700000000000003,129,null,24.3]
["FIRENZE UGOLINO provv 2017",302,"FIRENZE UGOLINO","provv 2017",70,null,null,null,null,69,127,65.7,119,null,null,70.3,120,67.3,114,null,24.4]
["FIRENZE UGOLINO Provvisorio buca 9 Par 3",303,"FIRENZE UGOLINO","Provvisorio buca 9 Par 3",70,null,null,null,null,69.400000000000006,129,66.099999999999994,121,null,null,70.7,122,67.900000000000006,116,null,24.5]
["FIRENZE UGOLINO Seconde Nove",304,"FIRENZE UGOLINO","Seconde Nove",36,null,null,null,null,35.700000000000003,135,33.700000000000003,130,null,null,36.200000000000003,120,34.6,117,null,24.6]
["FIUGGI 1928 18 Buche",305,"FIUGGI 1928","18 Buche",70,null,null,70.3,123,null,null,67.400000000000006,116,null,null,72.5,128,69.8,122,null,24.7]
["FIUGGI 1928 Prime Nove",306,"FIUGGI 1928","Prime Nove",35,null,null,35.299999999999997,130,null,null,33.799999999999997,124,null,null,36.4,135,35,128,null,24.8]
["FIUGGI 1928 Seconde Nove",307,"FIUGGI 1928","Seconde Nove",35,null,null,35,117,null,null,33.6,110,null,null,36.1,121,34.799999999999997,115,null,24.9]
["FOLGARIA 18 Buche",308,"FOLGARIA","18 Buche",72,null,null,null,null,70,124,66.7,116,null,null,72.599999999999994,124,69.2,117,null,25]
["FOLGARIA 9 buche nuove",309,"FOLGARIA","9 buche nuove",36,null,null,null,null,34.6,123,33.1,114,null,null,35.6,121,33.799999999999997,112,null,25.1]
["FOLGARIA Vecchie Nove",310,"FOLGARIA","Vecchie Nove",36,null,null,null,null,35.4,126,34.299999999999997,123,null,null,36.200000000000003,128,34.9,125,null,25.2]
["FONTI 18 Buche",311,"FONTI","18 Buche",72,null,null,73.400000000000006,130,71.8,126,69.099999999999994,120,76.7,130,73.400000000000006,124,70.7,118,null,25.3]
["FONTI Due volte le prime nove",312,"FONTI","Due volte le prime nove",72,null,null,null,null,71.599999999999994,128,69.400000000000006,121,null,null,73,125,70.400000000000006,120,null,25.4]
["FONTI Due volte le seconde nove",313,"FONTI","Due volte le seconde nove",72,null,null,null,null,71.8,126,69.599999999999994,121,null,null,73.8,122,71.400000000000006,118,null,25.5]
["FONTI Prime Nove",314,"FONTI","Prime Nove",36,null,null,36.6,131,35.799999999999997,128,34.700000000000003,121,38.200000000000003,133,36.5,125,35.200000000000003,120,null,25.6]
["FONTI Seconde Nove",315,"FONTI","Seconde Nove",36,null,null,36.9,129,35.9,126,34.799999999999997,121,38.4,127,36.9,122,35.700000000000003,118,null,25.7]
["FORTE MARMI 18 Buche",316,"FORTE MARMI","18 Buche",71,null,null,null,null,71.7,123,68.3,115,null,null,73.3,125,null,null,null,25.8]
["FORTE MARMI prime 9",317,"FORTE MARMI","prime 9",36,null,null,null,null,36.299999999999997,123,34.5,119,null,null,37,125,null,null,null,25.9]
["FORTE MARMI seconde 9",318,"FORTE MARMI","seconde 9",35,null,null,null,null,35.4,123,33.9,119,null,null,36.299999999999997,125,null,null,null,26]
["FRANCIACORTA B+S -12+7B",319,"FRANCIACORTA","B+S -12+7B",72,null,null,null,null,70.900000000000006,128,67.7,120,null,null,72.7,127,69.400000000000006,120,null,26.1]
["FRANCIACORTA B+S -3 +7B",320,"FRANCIACORTA","B+S -3 +7B",72,null,null,null,null,71,129,67.8,121,null,null,72.8,129,69.599999999999994,122,null,26.2]
["FRANCIACORTA B+S -5 +7B",{"$f":"1+B324","v":321},"FRANCIACORTA","B+S -5 +7B",70,null,null,null,null,71.599999999999994,132,68.2,124,null,null,73.5,132,70.099999999999994,125,null,{"$f":"ROUND(0.1+U324,1)","v":26.3}]
["FRANCIACORTA BRUT",322,"FRANCIACORTA","BRUT",37,null,null,null,null,36.1,128,34.5,124,null,null,37.299999999999997,131,35.5,127,null,26.4]
["FRANCIACORTA BRUT+ROSE'",323,"FRANCIACORTA","BRUT+ROSE'",71,null,null,71.5,135,70.2,131,67.099999999999994,124,72.599999999999994,132,71.7,127,68.400000000000006,120,null,26.5]
["FRANCIACORTA BRUT+SATEN",324,"FRANCIACORTA","BRUT+SATEN",73,null,null,72.599999999999994,134,72.099999999999994,132,68.7,124,74.5,133,73.8,131,70.400000000000006,124,null,26.6]
["FRANCIACORTA ROSE'",325,"FRANCIACORTA","ROSE'",34,null,null,null,null,34.1,133,32.6,130,null,null,34.4,123,32.799999999999997,120,null,26.7]
[{"$f":"_xlfn.TEXTJOIN(\" \",TRUE,C330:D330)","v":"FRANCIACORTA SATEN"},326,"FRANCIACORTA","SATEN",36,null,null,null,null,36,135,34.4,131,null,null,36.5,130,34.9,127,null,26.8]
["FRANCIACORTA SATEN+ROSE'",327,"FRANCIACORTA","SATEN+ROSE'",70,null,null,71.5,138,70.099999999999994,134,67,127,71.900000000000006,131,70.900000000000006,127,67.7,120,null,26.9]
["FRASSANELLE 18 Buche",328,"FRASSANELLE","18 Buche",72,null,null,72.900000000000006,135,71.5,131,69,125,74.5,135,73,129,70.400000000000006,124,null,27]
["FRASSANELLE Prime Nove",329,"FRASSANELLE","Prime Nove",36,null,null,36.200000000000003,136,35.6,133,34.299999999999997,127,37,132,36.4,125,35.1,120,null,27.1]
["FRASSANELLE Seconde Nove",330,"FRASSANELLE","Seconde Nove",36,null,null,36.6,133,35.9,129,34.700000000000003,123,37.5,138,36.5,134,35.200000000000003,129,null,27.2]
["FRONDE 18 Buche",331,"FRONDE","18 Buche",71,null,null,71.7,135,70.7,132,68.3,126,74.2,132,73.099999999999994,130,70.2,124,null,27.3]
["FRONDE Prime Nove",332,"FRONDE","Prime Nove",35,null,null,null,null,35.5,131,34.299999999999997,128,null,null,36.700000000000003,128,35.5,125,null,27.4]
["FRONDE Seconde Nove",333,"FRONDE","Seconde Nove",36,null,null,null,null,35.200000000000003,133,34.6,124,null,null,36.4,132,35.9,129,null,27.5]
["GARDAGOLF Bianco-Giallo",334,"GARDAGOLF","Bianco-Giallo",71,null,null,null,null,70.900000000000006,135,68.099999999999994,129,null,null,72.5,128,69.599999999999994,122,null,27.6]
["GARDAGOLF Prime Nove",335,"GARDAGOLF","Prime Nove",36,null,null,null,null,36.5,139,34.700000000000003,131,null,null,37.299999999999997,131,null,null,null,27.7]
["GARDAGOLF Rosso-Bianco",336,"GARDAGOLF","Rosso-Bianco",72,null,null,75,139,72.5,141,70.599999999999994,136,77.3,140,74.3,133,71.099999999999994,126,null,27.8]
["GARDAGOLF Rosso-Giallo",337,"GARDAGOLF","Rosso-Giallo",71,null,null,null,null,70.3,137,67.8,131,null,null,72.3,130,69.599999999999994,124,null,27.9]
["GARDAGOLF Seconde Nove",338,"GARDAGOLF","Seconde Nove",35,null,null,null,null,34.4,130,32.6,122,null,null,35.200000000000003,125,null,null,null,28]
["GARLENDA 18 Buche",339,"GARLENDA","18 Buche",72,null,null,72.5,134,72,133,69.5,127,null,null,73.599999999999994,130,69.5,122,null,28.1]
["GARLENDA Prime Nove",340,"GARLENDA","Prime Nove",36,null,null,35.9,137,35.799999999999997,136,34.5,130,null,null,36.799999999999997,126,34.799999999999997,118,null,28.2]
["GARLENDA Seconde Nove",341,"GARLENDA","Seconde Nove",36,null,null,36.6,138,36.299999999999997,136,35,130,null,null,36.9,132,34.799999999999997,124,null,28.3]
["GIRASOLI Perc NEW 1°Nove",342,"GIRASOLI","Perc NEW 1°Nove",36,null,null,null,null,36.1,133,34.9,130,null,null,36.700000000000003,136,35.299999999999997,133,null,28.4]
["GIRASOLI Perc NEW 2°Nove",343,"GIRASOLI","Perc NEW 2°Nove",35,null,null,null,null,34.4,124,33.200000000000003,121,null,null,34.9,136,33.700000000000003,133,null,28.5]
["GIRASOLI Perc OLD 1°Nove",344,"GIRASOLI","Perc OLD 1°Nove",35,null,null,null,null,34.5,124,null,null,null,null,35.1,124,null,null,null,28.6]
["GIRASOLI Perc OLD 2°Nove",345,"GIRASOLI","Perc OLD 2°Nove",36,null,null,null,null,36.299999999999997,129,null,null,null,null,37,135,null,null,null,28.7]
["GIRASOLI Percorso NEW",346,"GIRASOLI","Percorso NEW",71,null,null,70.8,130,70.5,129,68.099999999999994,123,null,null,71.599999999999994,130,69,125,null,28.8]
["GIRASOLI Percorso OLD",347,"GIRASOLI","Percorso OLD",71,null,null,71,128,70.8,127,null,null,null,null,72.099999999999994,130,null,null,null,28.9]
["GRADO 18 Buche",348,"GRADO","18 Buche",72,null,null,71.900000000000006,128,70.900000000000006,128,68,121,73.2,123,71.900000000000006,122,67.599999999999994,113,null,29]
["GRADO 9 Buche misto",349,"GRADO","9 Buche misto",36,null,null,null,null,34.9,124,33.4,120,null,null,35.200000000000003,122,33.1,118,null,29.1]
["GRADO prime 9",350,"GRADO","prime 9",36,null,null,null,null,35,123,33.6,117,null,null,35.4,119,32.5,110,null,29.2]
["GREEN CLUB 18 Buche",351,"GREEN CLUB","18 Buche",71,null,null,null,null,70.900000000000006,128,68.599999999999994,123,null,null,72.7,129,70.2,124,null,29.3]
["GREEN CLUB Prime Nove",352,"GREEN CLUB","Prime Nove",35,null,null,null,null,34.9,129,33.799999999999997,126,null,null,35.9,125,34.6,122,null,29.4]
["GREEN CLUB Seconde Nove",353,"GREEN CLUB","Seconde Nove",36,null,null,null,null,35.9,128,34.700000000000003,125,null,null,36.9,133,35.6,130,null,29.5]
["GRESSONEY 18 Buche",354,"GRESSONEY","18 Buche",68,null,null,null,null,65.5,112,63.5,108,null,null,66.5,120,66.5,120,null,29.6]
["GRESSONEY 18 buche 1-9 1-9",355,"GRESSONEY","18 buche 1-9 1-9",64,null,null,null,null,62.8,107,61,103,null,null,62.6,109,62.6,109,null,29.7]
["GRESSONEY 18 BUCHE 2018",356,"GRESSONEY","18 BUCHE 2018",68,null,null,null,null,64.599999999999994,117,62.4,112,null,null,66,123,66,123,null,29.8]
["GRESSONEY 18 BUCHE 2018 PROVV",357,"GRESSONEY","18 BUCHE 2018 PROVV",70,null,null,null,null,65.400000000000006,116,63.2,111,null,null,67.2,126,null,null,null,29.9]
["GRESSONEY 9 b provv 2017",358,"GRESSONEY","9 b provv 2017",33,null,null,null,null,31.6,108,30.7,104,null,null,31.8,113,null,null,null,30]
["GRESSONEY 9 buche",359,"GRESSONEY","9 buche",34,null,null,null,null,32.799999999999997,112,31.8,107,null,null,33.299999999999997,120,null,null,null,30.1]
["GRESSONEY 9 buche 1-9",360,"GRESSONEY","9 buche 1-9",32,null,null,null,null,31.4,107,30.5,103,null,null,31.3,109,null,null,null,30.2]
["GRESSONEY 9 BUCHE 2018",361,"GRESSONEY","9 BUCHE 2018",34,null,null,null,null,32.299999999999997,117,31.2,114,null,null,33,123,null,null,null,30.3]
["GRESSONEY 9 BUCHE 2018 PROVV",362,"GRESSONEY","9 BUCHE 2018 PROVV",35,null,null,null,null,32.700000000000003,116,31.6,110,null,null,33.6,126,null,null,null,30.4]
["GRESSONEY provv 2017",363,"GRESSONEY","provv 2017",66,null,null,null,null,63.2,108,61.4,104,null,null,63.6,113,null,null,null,30.5]
["HERMITAGE 18 buche",364,"HERMITAGE","18 buche",56,null,null,null,null,52.8,110,null,null,null,null,53,116,null,null,null,30.6]
["HERMITAGE 9 buche",365,"HERMITAGE","9 buche",28,null,null,null,null,26.4,110,null,null,null,null,26.5,116,null,null,null,30.7]
["IS ARENAS 18 Buche",366,"IS ARENAS","18 Buche",72,null,null,74,140,72.599999999999994,137,70.2,131,76.2,140,73,132,70.599999999999994,127,null,30.8]
["IS ARENAS 4-12 RIPETUTE",367,"IS ARENAS","4-12 RIPETUTE",72,null,null,null,null,71.599999999999994,129,69.099999999999994,123,null,null,72,119,70,115,null,30.9]
["IS ARENAS 9 buche 4-12",368,"IS ARENAS","9 buche 4-12",36,null,null,null,null,35.799999999999997,129,34.6,123,null,null,36,119,35,115,null,31]
["IS ARENAS MISTO 1-2-3-13.   18",369,"IS ARENAS","MISTO 1-2-3-13.   18",36,null,null,null,null,36.4,143,35.200000000000003,140,null,null,36.5,127,35.1,124,null,31.1]
["IS ARENAS Misto\n1-2-3-13-14-15-16-17-18",370,"IS ARENAS","Misto\n1-2-3-13-14-15-16-17-18",72,null,null,null,null,72.8,143,70.5,138,null,null,73,127,70.099999999999994,121,null,31.2]
["IS ARENAS Prime Nove",371,"IS ARENAS","Prime Nove",36,null,null,null,null,35.6,137,34.5,131,null,null,35.700000000000003,129,34.6,124,null,31.3]
["IS ARENAS Seconde Nove",372,"IS ARENAS","Seconde Nove",36,null,null,null,null,37,137,35.700000000000003,131,null,null,37.299999999999997,135,36,130,null,31.4]
["IS MOLAS 18 Buche",373,"IS MOLAS","18 Buche",72,null,null,74.5,134,73.5,131,69.5,122,76.7,133,75.599999999999994,130,71.3,121,null,31.5]
["IS MOLAS Prime Nove",374,"IS MOLAS","Prime Nove",35,null,null,null,null,36.700000000000003,130,34.700000000000003,121,null,null,37.6,126,35.5,117,null,31.6]
["IS MOLAS Prime-Terze",375,"IS MOLAS","Prime-Terze",71,null,null,null,null,73,136,69.400000000000006,128,null,null,75.599999999999994,134,71.8,134,null,31.7]
["IS MOLAS Seconde Nove",376,"IS MOLAS","Seconde Nove",37,null,null,null,null,36.799999999999997,132,34.799999999999997,123,null,null,38,134,35.9,125,null,31.8]
["IS MOLAS Seconde-Terze",377,"IS MOLAS","Seconde-Terze",73,null,null,null,null,73.099999999999994,137,69.599999999999994,129,null,null,76,138,72.2,129,null,31.9]
["IS MOLAS Terze Nove",378,"IS MOLAS","Terze Nove",36,null,null,null,null,36.299999999999997,141,34.799999999999997,134,null,null,38,141,36.4,134,null,32]
["IS MOLAS Terze-Terze",379,"IS MOLAS","Terze-Terze",72,null,null,null,null,72.599999999999994,141,69.5,134,null,null,76,141,72.8,134,null,32.1]
["JESOLO 18 Buche",380,"JESOLO","18 Buche",72,null,null,72.400000000000006,122,70.7,119,66.900000000000006,112,73.7,121,72,117,70.3,112,null,32.200000000000003]
["JESOLO Prime Nove",381,"JESOLO","Prime Nove",36,null,null,36.5,122,35.6,120,33.6,113,37,121,36.200000000000003,117,35.299999999999997,112,null,32.299999999999997]
["JESOLO Seconde Nove",382,"JESOLO","Seconde Nove",36,null,null,35.799999999999997,121,35.1,119,33.299999999999997,111,36.700000000000003,122,35.700000000000003,117,35,112,null,32.4]
["LAGHI 18 Buche",383,"LAGHI","18 Buche",73,null,null,74.900000000000006,143,73.400000000000006,139,71.099999999999994,134,76.7,146,75,142,72.7,137,null,32.5]
["LAGHI 18 Buche Piandisole",384,"LAGHI","18 Buche Piandisole",68,null,null,null,null,66.5,122,63.5,115,null,null,68,118,null,null,null,32.6]
["LAGHI Prime Nove",{"$f":"1+B388","v":385},"LAGHI","Prime Nove",36,null,null,37.200000000000003,144,36.4,141,35.1,134,38.4,141,37.6,137,36.299999999999997,131,null,{"$f":"ROUND(0.1+U388,1)","v":32.700000000000003}]
["LAGHI Prime Nove Piandisole",386,"LAGHI","Prime Nove Piandisole",34,null,null,null,null,33.4,124,null,null,null,null,34.1,117,null,null,null,32.799999999999997]
["LAGHI Seconde Nove",387,"LAGHI","Seconde Nove",37,null,null,37.700000000000003,139,37,136,36,132,38.299999999999997,150,37.4,146,36.5,142,null,32.9]
["LAGHI Seconde Nove Piandisole",388,"LAGHI","Seconde Nove Piandisole",34,null,null,null,null,33.1,120,31.5,113,null,null,33.9,119,null,null,null,33]
["LAMBORGHINI 18 Buche",389,"LAMBORGHINI","18 Buche",72,null,null,null,null,70,123,67,116,null,null,71.900000000000006,123,69,117,null,33.1]
[{"$f":"_xlfn.TEXTJOIN(\" \",TRUE,C394:D394)","v":"LAMBORGHINI Prime Nove"},390,"LAMBORGHINI","Prime Nove",36,null,null,null,null,35,123,33.5,120,null,null,36,123,34.6,120,null,33.200000000000003]
["LAMBORGHINI Seconde Nove",391,"LAMBORGHINI","Seconde Nove",36,null,null,null,null,35,123,null,null,null,null,36,123,null,null,null,33.299999999999997]
["LANA 18 Buche",392,"LANA","18 Buche",70,null,null,70.599999999999994,123,69,120,66.3,114,72,124,70.2,120,67.3,114,null,33.4]
["LANA 9 Buche",393,"LANA","9 Buche",35,null,null,35.299999999999997,123,34.5,120,33.200000000000003,114,36,124,35.1,120,33.700000000000003,114,null,33.5]
["LANA Misto Lana+Eppan",394,"LANA","Misto Lana+Eppan",70,null,null,70.900000000000006,120,null,null,null,null,69.8,120,null,null,null,null,null,33.6]
["LANZO 18 Buche",395,"LANZO","18 Buche",68,null,null,null,null,68.8,132,65.8,125,null,null,70.099999999999994,123,null,null,null,33.700000000000003]
["LANZO Prime Nove",396,"LANZO","Prime Nove",34,null,null,null,null,34.5,133,33,126,null,null,35.200000000000003,125,null,null,null,33.799999999999997]
["LANZO Seconde Nove",397,"LANZO","Seconde Nove",34,null,null,null,null,34.299999999999997,131,null,null,null,null,34.9,121,null,null,null,33.9]
["LAURI 18 buche par 68",398,"LAURI","18 buche par 68",68,null,null,null,null,64.8,122,63,118,null,null,66.599999999999994,114,66.599999999999994,114,null,34]
["LAURI 9 buche par 34",399,"LAURI","9 buche par 34",34,null,null,null,null,32.4,122,31.5,118,null,null,33.299999999999997,114,null,null,null,34.1]
["LECCO 18 Buche",400,"LECCO","18 Buche",71,null,null,null,null,70.8,135,68.7,130,null,null,72.7,134,71.7,132,null,34.200000000000003]
["LECCO Prime Nove",401,"LECCO","Prime Nove",34,null,null,null,null,33.299999999999997,124,32.299999999999997,119,null,null,34.200000000000003,120,33.700000000000003,118,null,34.299999999999997]
["LECCO Prime Nove 2 volte",402,"LECCO","Prime Nove 2 volte",68,null,null,null,null,66.599999999999994,124,64.5,119,null,null,68.400000000000006,120,67.400000000000006,118,null,34.4]
["LECCO Seconde Nove",403,"LECCO","Seconde Nove",37,null,null,null,null,37.5,146,36.5,141,null,null,38.5,148,38,146,null,34.5]
["LECCO Seconde Nove 2 volte",404,"LECCO","Seconde Nove 2 volte",74,null,null,null,null,75,146,73,141,null,null,77,148,76,146,null,34.6]
["LIGNANO 18 Buche",405,"LIGNANO","18 Buche",72,null,null,73.599999999999994,136,72.099999999999994,133,68.599999999999994,125,76.3,138,73,131,69.5,124,null,34.700000000000003]
["LIGNANO Prime Nove",406,"LIGNANO","Prime Nove",36,null,null,36.9,135,36.1,133,34.200000000000003,129,38.9,139,36.700000000000003,131,35,127,null,34.799999999999997]
["LIGNANO Seconde Nove",407,"LIGNANO","Seconde Nove",36,null,null,36.700000000000003,137,36,133,34.200000000000003,129,37.5,136,36.299999999999997,132,34.5,128,null,34.9]
["LIMONE 18 Buche",408,"LIMONE","18 Buche",60,null,null,null,null,62.6,103,null,null,null,null,62.5,101,null,null,null,35]
["LIMONE Prime Nove",409,"LIMONE","Prime Nove",30,null,null,null,null,31.3,104,null,null,null,null,31.3,101,null,null,null,35.1]
["LIMONE Seconde Nove",410,"LIMONE","Seconde Nove",30,null,null,null,null,31.3,104,null,null,null,null,31.3,101,null,null,null,35.200000000000003]
["LIVORNO 18 Buche",411,"LIVORNO","18 Buche",56,null,null,null,null,58.8,100,58.4,99,null,null,60,98,60,98,null,35.299999999999997]
["LIVORNO 9 Buche",412,"LIVORNO","9 Buche",28,null,null,null,null,29.4,100,29.2,99,null,null,30,98,30,98,null,35.4]
["MADONNA CAMPIGLIO Nove Buche",413,"MADONNA CAMPIGLIO","Nove Buche",35,null,null,null,null,34.700000000000003,128,33.5,122,null,null,36.299999999999997,138,35,130,null,35.5]
["MADONNA CAMPIGLIO Nuovo",414,"MADONNA CAMPIGLIO","Nuovo",70,null,null,null,null,69.400000000000006,130,66.900000000000006,124,null,null,72.900000000000006,136,69.7,129,null,35.6]
["MANTOVA 18 buche",415,"MANTOVA","18 buche",68,null,null,null,null,64.400000000000006,104,62.8,100,null,null,65.400000000000006,113,65.400000000000006,113,null,35.700000000000003]
["MANTOVA 9 buche",416,"MANTOVA","9 buche",34,null,null,null,null,32.200000000000003,104,31.4,100,null,null,32.700000000000003,113,32.700000000000003,113,null,35.799999999999997]
["MARCO SIMONE 18 buche 2020",417,"MARCO SIMONE","18 buche 2020",72,75.3,133,73.400000000000006,128,70.900000000000006,123,68.400000000000006,117,76.900000000000006,137,73.900000000000006,131,70.2,123,null,35.9]
["MARCO SIMONE prime 9 2020",418,"MARCO SIMONE","prime 9 2020",36,37.700000000000003,133,36.9,130,35.6,125,34.299999999999997,119,38.700000000000003,140,37.1,134,35.200000000000003,126,null,36]
["MARCO SIMONE prime nove 2019",419,"MARCO SIMONE","prime nove 2019",36,null,null,36.5,141,35.799999999999997,138,33.799999999999997,133,37.200000000000003,134,36.4,131,34.4,127]
["MARCO SIMONE prime nove 2019 2 volte",420,"MARCO SIMONE","prime nove 2019 2 volte",72,null,null,73,141,71.599999999999994,138,67.599999999999994,133,74.400000000000006,134,72.8,131,68.8,127]
["MARCO SIMONE Resort 18 Buche",{"$f":"1+B424","v":421},"MARCO SIMONE","Resort 18 Buche",64,null,null,null,null,61.6,97,58.2,89,null,null,63.4,100,60.4,94]
["MARCO SIMONE Resort 9 Buche",422,"MARCO SIMONE","Resort 9 Buche",32,null,null,null,null,30.8,97,29.1,89,null,null,31.7,100,30.2,94]
["MARCO SIMONE seconde 9 2020",423,"MARCO SIMONE","seconde 9 2020",36,37.6,132,36.5,126,35.299999999999997,121,34.1,115,38.200000000000003,133,36.799999999999997,127,35,119]
["MARCO SIMONE seconde 9 2020 x 2",424,"MARCO SIMONE","seconde 9 2020 x 2",72,75.2,132,73,126,70.599999999999994,121,68.2,115,76.400000000000006,133,73.599999999999994,127,70,119]
["MARE ROMA 18 Buche",425,"MARE ROMA","18 Buche",70,null,null,null,null,69.5,126,67.2,121,null,null,70.7,127,68,121]
["MARE ROMA Prime Nove",426,"MARE ROMA","Prime Nove",35,null,null,null,null,34.799999999999997,126,33.6,121,null,null,35.200000000000003,127,34,121]
["MARE ROMA Seconde Nove",427,"MARE ROMA","Seconde Nove",35,null,null,null,null,34.799999999999997,126,null,null,null,null,35.4,127]
["MARGARA La Guazzetta",428,"MARGARA","La Guazzetta",72,null,null,75.099999999999994,129,72.900000000000006,124,68.8,115,76.2,132,74.2,125,"70,8\n17/1","118\n/20, 10:5"]
["MARGARA Lolli Ghetti",429,"MARGARA","Lolli Ghetti",72,null,null,73.900000000000006,133,72.5,130,69.400000000000006,123,75.7,131,74.599999999999994,128,71,120]
["MARGARA Prime Nove",430,"MARGARA","Prime Nove",36,null,null,null,null,36.6,134,35,127,null,null,37.799999999999997,130]
["MARGARA Prime Nove Giallo",431,"MARGARA","Prime Nove Giallo",36,null,null,null,null,36.700000000000003,128,null,null,null,null,37.799999999999997,130]
["MARGARA Seconde Nove",432,"MARGARA","Seconde Nove",36,null,null,null,null,35.799999999999997,126,34.299999999999997,119,null,null,36.799999999999997,127]
["MARGHERITA 18 Buche",433,"MARGHERITA","18 Buche",72,null,null,73.8,138,72.400000000000006,136,69.7,130,77,139,75.400000000000006,134,72.2,127]
["MARGHERITA Prime Nove",434,"MARGHERITA","Prime Nove",36,null,null,null,null,36,139,34.9,134,null,null,37.799999999999997,133,36.1,126]
["MARGHERITA Seconde Nove",435,"MARGHERITA","Seconde Nove",36,null,null,null,null,36.4,132,34.799999999999997,125,null,null,37.6,134,36.1,128]
["MARINA VELKA 18 Buche",436,"MARINA VELKA","18 Buche",70,null,null,null,null,69.599999999999994,121,67,115,null,null,71.599999999999994,125,68.7,119]
["MARINA VELKA 9 Buche",437,"MARINA VELKA","9 Buche",35,null,null,null,null,34.799999999999997,121,33.5,118,null,null,35.799999999999997,125,34.299999999999997,122]
["MATILDE GOLF 18 Buche",438,"MATILDE GOLF","18 Buche",72,null,null,72.599999999999994,136,71.400000000000006,133,67.599999999999994,124,74.3,128,73,126,69.099999999999994,118]
["MATILDE GOLF Prime Nove",439,"MATILDE GOLF","Prime Nove",36,null,null,35.799999999999997,131,35.200000000000003,129,33.5,121,36.799999999999997,124,36.1,122]
["MATILDE GOLF Provvisorio",440,"MATILDE GOLF","Provvisorio",72,null,null,null,null,71.3,132,null,null,null,null,73.2,125]
["MATILDE GOLF Seconde Nove",441,"MATILDE GOLF","Seconde Nove",36,null,null,36.799999999999997,140,36.200000000000003,137,34.1,127,37.5,133,36.9,130]
["MENAGGIO 18 Buche",442,"MENAGGIO","18 Buche",70,null,null,69.3,133,69.3,133,67,128,71.3,126,71.3,126,69,121]
["MENAGGIO Prime Nove",443,"MENAGGIO","Prime Nove",34,null,null,null,null,35.200000000000003,127,34,122,null,null,35.9,126,34.799999999999997,121]
["MENAGGIO Seconde Nove",444,"MENAGGIO","Seconde Nove",36,null,null,null,null,34.1,139,33.5,134,null,null,35.4,126,34.299999999999997,121]
["METAPONTO 18 buche",445,"METAPONTO","18 buche",72,null,null,73.2,130,72.099999999999994,128,68.7,120,77.900000000000006,134,73.7,125,70,117]
["METAPONTO Prime Nove",446,"METAPONTO","Prime Nove",36,null,null,null,null,36.200000000000003,129,34.6,121,null,null,37.1,127,35.299999999999997,119]
["METAPONTO Seconde Nove",447,"METAPONTO","Seconde Nove",36,null,null,null,null,35.799999999999997,127,34.1,117,null,null,36.6,122,34.700000000000003,114]
["MIGLIANICO 18 Buche",448,"MIGLIANICO","18 Buche",72,null,null,71.599999999999994,129,70.400000000000006,126,67.400000000000006,119,74.400000000000006,125,73.900000000000006,125,70.5,117]
["MIGLIANICO Campionati a squadre 2015",{"$f":"1+B452","v":449},"MIGLIANICO","Campionati a squadre 2015",71,null,null,71.3,128]
["MIGLIANICO Prime Nove",450,"MIGLIANICO","Prime Nove",36,null,null,null,null,34.799999999999997,126,33.299999999999997,119,null,null,36.6,125,35,117]
["MIGLIANICO Seconde Nove",451,"MIGLIANICO","Seconde Nove",36,null,null,null,null,35.6,126,34,119,null,null,37.1,123,35.5,117]
["MILANO 1/2",452,"MILANO","1/2",72,null,null,75,132,73.400000000000006,129,69.8,121,76.599999999999994,132,75.3,129,72,122]
["MILANO 1/3",453,"MILANO","1/3",72,null,null,null,null,72,126,68.7,118,null,null,73.900000000000006,124,70.599999999999994,117]
["MILANO 2/3",454,"MILANO","2/3",72,null,null,null,null,72,126,68.5,118,null,null,74,126,70.5,119]
["MILANO Nove Perc.1",455,"MILANO","Nove Perc.1",36,null,null,null,null,36.799999999999997,129,35,120,null,null,37.700000000000003,126,36,119]
[{"$f":"_xlfn.TEXTJOIN(\" \",TRUE,C460:D460)","v":"MILANO Nove Perc.2"},456,"MILANO","Nove Perc.2",36,null,null,null,null,36.6,128,34.799999999999997,119,null,null,37.6,131,35.9,124]
["MILANO Nove Perc.3",457,"MILANO","Nove Perc.3",36,null,null,null,null,35.4,126,33.799999999999997,122,null,null,36.5,121,34.799999999999997,117]
["MILANO Percorso 1/2 Provvisorio",458,"MILANO","Percorso 1/2 Provvisorio",72,null,null,null,null,73,128,null,null,null,null,74.900000000000006,128]
["MIRABELLA 18 Buche",459,"MIRABELLA","18 Buche",62,null,null,null,null,64.5,121,62.2,116,null,null,67.2,114,67.2,114]
["MIRABELLA Prime Nove",460,"MIRABELLA","Prime Nove",31,null,null,null,null,32.299999999999997,121,32.299999999999997,121,null,null,33.6,114]
["MIRABELLA Seconde Nove",461,"MIRABELLA","Seconde Nove",31,null,null,null,null,32.200000000000003,121,null,null,null,null,33.6,114]
["MODENA 18 Buche",462,"MODENA","18 Buche",72,null,null,73.599999999999994,131,72.2,128,70.2,123,74.900000000000006,130,73.7,127,71.599999999999994,123]
["MODENA Prime Nove",463,"MODENA","Prime Nove",36,null,null,36.9,134,36.200000000000003,132,35.200000000000003,128,37.799999999999997,129,36.700000000000003,126,35.799999999999997,123]
["MODENA Provvisorio 2021",{"$f":"1+B467","v":464},"MODENA","Provvisorio 2021",71,null,null,null,null,71.8,126,68.8,121,null,null,73.2,126,71.099999999999994,122]
["MODENA Provvisorio B.13 par 3",{"$f":"1+B468","v":465},"MODENA","Provvisorio B.13 par 3",70,null,null,71.599999999999994,126,70.400000000000006,124,68.599999999999994,119,72.8,126,71.8,123,69.900000000000006,119]
["MODENA Seconde Nove",466,"MODENA","Seconde Nove",36,null,null,36.799999999999997,125,36,123,35,119,37.200000000000003,130,37,127,35.799999999999997,122]
["MOLINETTO 18 Buche",467,"MOLINETTO","18 Buche",71,null,null,71.900000000000006,131,71.400000000000006,130,68.8,124,73.5,129,72.5,127,69.7,121]
["MOLINETTO Prime Nove",468,"MOLINETTO","Prime Nove",36,null,null,36.1,134,35.799999999999997,132,34.6,129,37.299999999999997,131,36.700000000000003,128,35.4,125]
["MOLINETTO Seconde Nove",469,"MOLINETTO","Seconde Nove",35,null,null,35.700000000000003,130,35.6,129,34.299999999999997,126,36.200000000000003,128,35.9,125,34.4,122]
["MOLINO PERO 18 Buche",470,"MOLINO PERO","18 Buche",70,null,null,null,null,67.8,124,64.400000000000006,116,null,null,68.8,120]
["MOLINO PERO MOLINO PERO 2016",471,"MOLINO PERO","MOLINO PERO 2016",69,null,null,null,null,67.5,123,64,115,null,null,68,119,68,119]
["MOLINO PERO PRIME 9 2016",472,"MOLINO PERO","PRIME 9 2016",34,null,null,null,null,32.700000000000003,119,31.4,113,null,null,32.9,119]
["MOLINO PERO Prime Nove",473,"MOLINO PERO","Prime Nove",35,null,null,null,null,33.5,123,31.9,116,null,null,33.700000000000003,122]
["MOLINO PERO SECONDE 9 2016",474,"MOLINO PERO","SECONDE 9 2016",35,null,null,null,null,34.799999999999997,127,32.700000000000003,117,null,null,35.1,118]
["MOLINO PERO Seconde Nove",475,"MOLINO PERO","Seconde Nove",35,null,null,null,null,34.299999999999997,125,32.700000000000003,118,null,null,35.200000000000003,119]
["MONASTERI 18 Buche",476,"MONASTERI","18 Buche",71,null,null,75.5,145,73.5,140,69.599999999999994,131,77.2,142,73.2,134,70.099999999999994,127]
["MONASTERI Prime Nove",477,"MONASTERI","Prime Nove",35,null,null,null,null,36.200000000000003,130,34.700000000000003,126,null,null,35.799999999999997,126,34.5,123]
["MONASTERI Seconde Nove",478,"MONASTERI","Seconde Nove",36,null,null,null,null,37.299999999999997,150,35.700000000000003,146,null,null,37.4,142,35.799999999999997,139]
["MONCALIERI 18 Buche",479,"MONCALIERI","18 Buche",64,null,null,63.7,102,62.7,100,60.2,94,65.099999999999994,103,63.6,100,63.6,100]
["MONCALIERI 9 buche",480,"MONCALIERI","9 buche",32,null,null,31.8,102,31.3,100,30.1,94,32.5,103,31.8,100]
["MONFERRATO Bianco/Blu 9B",481,"MONFERRATO","Bianco/Blu 9B",33,null,null,31.9,113,null,null,null,null,32,112]
["MONFERRATO Giallo/Rosso 9B",482,"MONFERRATO","Giallo/Rosso 9B",33,null,null,null,null,31.8,111,null,null,null,null,31.3,109]
["MONFERRATO Misto 18 Buche",483,"MONFERRATO","Misto 18 Buche",66,null,null,63.7,112,63.7,112,62,108,63.4,111,63.4,111]
["MONTE CIMONE 18 Buche",484,"MONTE CIMONE","18 Buche",68,null,null,65.400000000000006,112,65,112,63,107,67.8,122,67.2,121,67.2,121]
["MONTE CIMONE Prime Nove",485,"MONTE CIMONE","Prime Nove",34,null,null,32.700000000000003,112,32.5,112,31.5,107,33.9,122,33.6,121]
["MONTEBELLUNA Campionato",486,"MONTEBELLUNA","Campionato",72,null,null,71.099999999999994,123,71.099999999999994,123,68.400000000000006,117,73.3,127,73.3,127,70.3,121]
["MONTEBELLUNA Misto",487,"MONTEBELLUNA","Misto",71,null,null,70,124,70,124,67.400000000000006,118,72,125,72,125,69.2,119]
["MONTEBELLUNA Prime Nove",488,"MONTEBELLUNA","Prime Nove",36,null,null,35.6,123,35.6,123,34.299999999999997,120,36.700000000000003,127,36.700000000000003,127,35.299999999999997,124]
["MONTEBELLUNA Seconde Nove",489,"MONTEBELLUNA","Seconde Nove",36,null,null,35.6,123,35.6,123,34.299999999999997,120,36.700000000000003,127,36.700000000000003,127,35.299999999999997,124]
["MONTECATINI TERME 18 Buche",490,"MONTECATINI TERME","18 Buche",72,null,null,72.099999999999994,137,71.2,135,67.400000000000006,126,73.400000000000006,130,72.2,128,69.8,123]
["MONTECATINI TERME Prime Nove",491,"MONTECATINI TERME","Prime Nove",37,null,null,36.799999999999997,136,36.4,135,34.700000000000003,127,37.6,134,37.1,133,35.700000000000003,127]
["MONTECATINI TERME Seconde Nove",492,"MONTECATINI TERME","Seconde Nove",35,null,null,35.299999999999997,138,34.799999999999997,135,32.799999999999997,126,35.799999999999997,126,35.1,123,34.1,119]
["MONTECCHIA 18 buche - albarella",{"$f":"1+B496","v":493},"MONTECCHIA","18 buche - albarella",72,null,null,72,121,70.5,118,68.2,113,73.8,125,72.5,121,70,116]
["MONTECCHIA prime nove - albarella",494,"MONTECCHIA","prime nove - albarella",36,null,null,null,null,35.4,119,34.299999999999997,114,null,null,36.4,126,35.1,121]
["MONTECCHIA seconde nove - albarella",495,"MONTECCHIA","seconde nove - albarella",36,null,null,null,null,35.1,117,34,112,null,null,36.1,116,34.9,111]
["MONTECCHIA Bianco 9 b.",{"$f":"1+B499","v":496},"MONTECCHIA","Bianco 9 b.",36,null,null,null,null,36.299999999999997,129,33.9,118,null,null,37.299999999999997,125,34.799999999999997,115]
["MONTECCHIA Bianco-Giallo",497,"MONTECCHIA","Bianco-Giallo",72,null,null,72.900000000000006,126,71.8,126,68,117,74.2,125,73.2,122,69.8,115]
["MONTECCHIA Bianco-Rosso",498,"MONTECCHIA","Bianco-Rosso",72,null,null,73.2,129,72.099999999999994,128,67.599999999999994,118,75.400000000000006,127,74.099999999999994,124,69.2,114]
["MONTECCHIA Galzignano Course",499,"MONTECCHIA","Galzignano Course",31,null,null,null,null,30.9,108,30.1,104,null,null,30.6,102,29.7,98]
["MONTECCHIA Giallo 9 b.",500,"MONTECCHIA","Giallo 9 b.",36,null,null,null,null,35.5,123,34.1,117,null,null,35.9,119,35,115]
["MONTECCHIA Giallo-Giallo",501,"MONTECCHIA","Giallo-Giallo",72,null,null,null,null,71,123,68.2,117,null,null,71.8,119,70,115]
["MONTECCHIA Rosso 9 b.",502,"MONTECCHIA","Rosso 9 b.",36,null,null,null,null,35.700000000000003,126,33.6,116,null,null,36.799999999999997,123,34.4,113]
["MONTECCHIA Rosso-Giallo",503,"MONTECCHIA","Rosso-Giallo",72,null,null,72.2,126,71.3,124,67.7,117,73.599999999999994,123,72.599999999999994,121,69.400000000000006,114]
["MONTELUPO bianco 2020",504,"MONTELUPO","bianco 2020",68,null,null,null,null,67.099999999999994,120,64.2,113,null,null,68,113,65.5,108]
["MONTELUPO blu 2020",505,"MONTELUPO","blu 2020",70,null,null,null,null,69.599999999999994,126,66.5,119,null,null,71,117,67.900000000000006,110]
["MONTELUPO blu 2020 9 buche",506,"MONTELUPO","blu 2020 9 buche",35,null,null,null,null,34.799999999999997,126,33.200000000000003,119,null,null,35.5,117,34,110]
["MONTELUPO giallo 2020",507,"MONTELUPO","giallo 2020",68,null,null,null,null,67.2,119,64.3,113,null,null,68.099999999999994,112,65.099999999999994,106]
["MONTELUPO rosso 2020",508,"MONTELUPO","rosso 2020",68,null,null,null,null,66.900000000000006,119,64,112,null,null,67.900000000000006,112,64.900000000000006,106]
["MONTELUPO verde 2020",509,"MONTELUPO","verde 2020",69,null,null,null,null,68.099999999999994,121,65.2,114,null,null,69.2,114,66.099999999999994,107]
["MONTEVEGLIO 18 Buche",510,"MONTEVEGLIO","18 Buche",64,null,null,null,null,63.4,114,60.6,108,null,null,63.6,108,63.6,108]
["MONTEVEGLIO Nove Buche",511,"MONTEVEGLIO","Nove Buche",32,null,null,null,null,31.7,114,30.3,108,null,null,31.8,108]
["MONTICELLO Blu",512,"MONTICELLO","Blu",72,null,null,72.400000000000006,134,71.400000000000006,132,69.400000000000006,121,74.5,131,73.2,128,70.7,118]
["MONTICELLO Blu 2 (Ridotto)",{"$f":"1+B516","v":513},"MONTICELLO","Blu 2 (Ridotto)",72,null,null,null,null,69.2,120,null,null,null,null,70.400000000000006,117]
["MONTICELLO Prime Nove Blu",514,"MONTICELLO","Prime Nove Blu",36,null,null,36.5,131,36,129,35,118,37.5,126,36.799999999999997,123,35.5,113]
["MONTICELLO Prime Nove Rosso",515,"MONTICELLO","Prime Nove Rosso",36,null,null,36.799999999999997,135,35.799999999999997,134,34.200000000000003,126,38,131,36.9,127,35.299999999999997,122]
["MONTICELLO Rosso",516,"MONTICELLO","Rosso",72,null,null,74,134,72.099999999999994,133,70.400000000000006,126,75.900000000000006,131,73.8,128,72.2,123]
["MONTICELLO Rosso1+Blu1",517,"MONTICELLO","Rosso1+Blu1",72,null,null,73.3,133,71.8,132,69.2,119,75.5,129,73.7,125,70.900000000000006,118]
["MONTICELLO Rosso1+Blu2",518,"MONTICELLO","Rosso1+Blu2",72,null,null,72.7,136,71.3,135,68.7,125,75,133,72.400000000000006,130,70.400000000000006,123]
["MONTICELLO Rosso2+Blu1",519,"MONTICELLO","Rosso2+Blu1",72,null,null,73.8,132,72.3,131,69.2,122,75.5,129,72.8,126,70.8,118]
["MONTICELLO Rosso2+Blu2",520,"MONTICELLO","Rosso2+Blu2",72,null,null,73.2,135,71.8,134,68.7,125,75,133,72.400000000000006,130,70.400000000000006,123]
["MONTICELLO Sec. Nove Blu",521,"MONTICELLO","Sec. Nove Blu",36,null,null,35.9,137,35.5,135,34.5,124,37,135,36.4,133,35.1,123]
["MONTICELLO Sec.Nove Rosso",522,"MONTICELLO","Sec.Nove Rosso",36,null,null,37.299999999999997,133,36.299999999999997,132,34.200000000000003,126,38,131,36.9,128,35.299999999999997,122]
["MULINO CERRIONE 18 BUCHE",523,"MULINO CERRIONE","18 BUCHE",72,null,null,68.900000000000006,130,68.2,119,66,114,72,123,71,121,68.900000000000006,117]
[{"$f":"_xlfn.TEXTJOIN(\" \",TRUE,C528:D528)","v":"MULINO CERRIONE NOVE BUCHE"},524,"MULINO CERRIONE","NOVE BUCHE",36,null,null,34.5,130,34.1,119,33,114,36,123,35,121,34.5,117]
["MUSELLA 18 buche",525,"MUSELLA","18 buche",66,null,null,null,null,61.6,107,596,103,null,null,61.8,109]
["MUSELLA 9 buche",526,"MUSELLA","9 buche",33,null,null,null,null,30.8,107,29.8,103,null,null,30.9,109]
["NAPOLI 18 Buche",527,"NAPOLI","18 Buche",70,null,null,69.099999999999994,117,67,112,63.8,105,74.400000000000006,122,70.400000000000006,113,66.5,105]
["NAPOLI 9 buche",528,"NAPOLI","9 buche",35,null,null,34.299999999999997,116,33.200000000000003,111,31.4,102,37,123,34.9,114,33.5,108]
["NAPOLI 9 BUCHE 2°GIRO",529,"NAPOLI","9 BUCHE 2°GIRO",35,null,null,34.799999999999997,118,33.799999999999997,113,32.4,108,37.4,121,35.5,112,33,102]
["NAZIONALE Campionato",{"$f":"1+B533","v":530},"NAZIONALE","Campionato",72,null,null,73.8,145,71.7,142,69.099999999999994,136,75.400000000000006,142,73.2,135,70.400000000000006,129]
["NAZIONALE provvisorio 2021",{"$f":"1+B534","v":531},"NAZIONALE","provvisorio 2021",70,null,null,null,null,68.8,134,66.7,129,null,null,70.3,127,67.900000000000006,122]
["NAZIONALE Carta",532,"NAZIONALE","Carta",72,null,null,73.400000000000006,144,73.400000000000006,144,null,null,75.099999999999994,142,75.099999999999994,142]
["NAZIONALE Prime Nove",533,"NAZIONALE","Prime Nove",36,null,null,37.200000000000003,151,35.799999999999997,143,34.5,136,37.799999999999997,147,36.799999999999997,142,35.4,132]
["NAZIONALE Seconde Nove",534,"NAZIONALE","Seconde Nove",36,null,null,37.200000000000003,143,35.9,142,34.6,135,38.1,142,36.4,129,35,126]
["OASI DI MAGLIANO- FIORDALISI 18 Buche",535,"OASI DI MAGLIANO- FIORDALISI","18 Buche",72,null,null,72.5,130,71,128,69.599999999999994,125,73.599999999999994,122,71.900000000000006,120,70.2,116]
["OASI DI MAGLIANO- FIORDALISI Misto B/G",536,"OASI DI MAGLIANO- FIORDALISI","Misto B/G",72,null,null,null,null,71.7,129,null,null,null,null,72.8,121]
["OASI DI MAGLIANO- FIORDALISI Prime Nove",537,"OASI DI MAGLIANO- FIORDALISI","Prime Nove",36,null,null,36.200000000000003,130,35.5,128,null,null,36.799999999999997,122,36,120]
["OASI DI MAGLIANO- FIORDALISI Seconde Nove",538,"OASI DI MAGLIANO- FIORDALISI","Seconde Nove",36,null,null,36.200000000000003,130,35.5,128,null,null,36.799999999999997,122,36,120]
["OLGIATA 9 Buche GIALLO",539,"OLGIATA","9 Buche GIALLO",36,null,null,37.5,137,36.4,134,35,128,38.1,135,37.299999999999997,133,35.799999999999997,128]
["OLGIATA 9 Buche VERDE",540,"OLGIATA","9 Buche VERDE",37,null,null,38,139,37.299999999999997,138,35.6,130,39.5,141,38.4,137,36.4,130]
["OLGIATA Blu 9 Buche",541,"OLGIATA","Blu 9 Buche",36,null,null,null,null,36.5,129,35,122,null,null,37.1,125]
["OLGIATA Blu-Blu",542,"OLGIATA","Blu-Blu",72,null,null,null,null,73,129,70,122,null,null,74.2,125]
["OLGIATA Championship Course",543,"OLGIATA","Championship Course",71,null,null,77.400000000000006,142,null,null,null,null,77.599999999999994,139]
["OLGIATA Percorso Ovest Par 71",544,"OLGIATA","Percorso Ovest Par 71",71,null,null,74.5,134,72.900000000000006,132,70,125,76.2,131,74,127,70.8,120]
["OLGIATA Percorso Ovest Par 72",545,"OLGIATA","Percorso Ovest Par 72",72,null,null,75.2,138,73.2,134,69.8,126,77.2,137,75.099999999999994,134,71.5,126]
["OLGIATA Percorso Ovest Par 73",546,"OLGIATA","Percorso Ovest Par 73",73,null,null,75.5,138,73.7,136,70.3,128,77.599999999999994,138,75.7,135,72.099999999999994,127]
["PADOVA Blu-Giallo",547,"PADOVA","Blu-Giallo",72,null,null,72.2,130,70.5,128,69,124,74.2,127,72.400000000000006,123,71,120]
["PADOVA Old Course",548,"PADOVA","Old Course",72,null,null,72.5,129,70.7,125,69.3,122,74,127,72.599999999999994,125,71.3,122]
["PADOVA Prime Nove (Giallo)",549,"PADOVA","Prime Nove (Giallo)",36,null,null,35.700000000000003,129,34.9,127,34.200000000000003,125,36.799999999999997,127,35.9,124,35.200000000000003,123]
["PADOVA Rosso-Blu",550,"PADOVA","Rosso-Blu",72,null,null,73,129,71.3,126,69.400000000000006,122,74.599999999999994,125,72.7,121,71.599999999999994,119]
["PADOVA Rosso-Giallo",551,"PADOVA","Rosso-Giallo",72,null,null,72.2,128,70.599999999999994,125,68.900000000000006,121,74,126,72.099999999999994,122,71,120]
["PADOVA Seconde Nove (Rosso)",552,"PADOVA","Seconde Nove (Rosso)",36,null,null,36.5,126,35.700000000000003,123,34.700000000000003,121,37.200000000000003,124,36.200000000000003,120,35.799999999999997,119]
["PALERMO 18 buche",553,"PALERMO","18 buche",64,null,null,null,null,62.4,112,59.1,104,null,null,62,102]
["PALERMO 9 buche",554,"PALERMO","9 buche",32,null,null,null,null,31.2,112,29.6,104,null,null,31,102]
["PANORAMA GOLF 18 Buche",555,"PANORAMA GOLF","18 Buche",66,null,null,null,null,64,111,61.5,105,null,null,64.599999999999994,107,64.599999999999994,107]
["PANORAMA GOLF Prime Nove",556,"PANORAMA GOLF","Prime Nove",33,null,null,null,null,32,111,30.8,105,null,null,32.299999999999997,107]
["PANORAMA GOLF Seconde Nove",557,"PANORAMA GOLF","Seconde Nove",33,null,null,null,null,32,111,30.8,105,null,null,32.299999999999997,107]
["PARADISO 18 Buche",558,"PARADISO","18 Buche",71,null,null,71.3,136,69.2,134,67,129,73.8,136,70,128,67.7,123]
["PARADISO 2020",559,"PARADISO",2020,70,null,null,69.599999999999994,140,67.7,136,63.7,127,71.599999999999994,130,68.7,124,64.3,115]
["PARADISO Prime Nove",560,"PARADISO","Prime Nove",35,null,null,null,null,34.1,131,null,null,null,null,34.1,127]
["PARADISO provv 2019",561,"PARADISO","provv 2019",71,null,null,null,null,68.8,143,66.599999999999994,138,null,null,70,128,67.5,122]
["PARADISO Seconde Nove",562,"PARADISO","Seconde Nove",36,null,null,null,null,35.1,137,null,null,null,null,35.9,128]
["PARCO FIRENZE 18 Buche",563,"PARCO FIRENZE","18 Buche",62,null,null,null,null,59.4,99,59.3,99,null,null,60.7,99,60.7,99]
["PARCO FIRENZE Prime Nove",564,"PARCO FIRENZE","Prime Nove",31,null,null,null,null,29.7,99,29.6,99,null,null,30.4,99]
["PARCO MEDICI 9 Buche Bianco",565,"PARCO MEDICI","9 Buche Bianco",35,null,null,null,null,34.700000000000003,132,33.4,129,null,null,35.6,123,34.1,120]
["PARCO MEDICI 9 Buche Blu",566,"PARCO MEDICI","9 Buche Blu",37,null,null,null,null,36.4,140,34.799999999999997,136,null,null,37.1,138,35.5,135]
["PARCO MEDICI 9 buche Rosso",567,"PARCO MEDICI","9 buche Rosso",35,null,null,null,null,34.200000000000003,124,32.9,118,null,null,35.299999999999997,122,33.9,116]
["PARCO MEDICI Blu/Bianco (Champ.Invertito)",568,"PARCO MEDICI","Blu/Bianco (Champ.Invertito)",72,null,null,73,136,71.099999999999994,136,68.2,129,74.7,137,72.7,130,69.599999999999994,123]
["PARCO MEDICI Championship Bianco/Blu",569,"PARCO MEDICI","Championship Bianco/Blu",72,null,null,73,136,71.099999999999994,136,68.2,129,74.7,137,72.7,130,69.599999999999994,123]
["PARCO MEDICI Est (Rosso x 2)",570,"PARCO MEDICI","Est (Rosso x 2)",70,null,null,null,null,68.400000000000006,124,65.8,118,null,null,70.599999999999994,122,67.7,116]
["PARCO MEDICI King Blu/Rosso",571,"PARCO MEDICI","King Blu/Rosso",72,null,null,null,null,70.599999999999994,132,67.7,127,null,null,72.400000000000006,130,69.400000000000006,125]
["PARCO MEDICI Queen Bianco/Rosso",572,"PARCO MEDICI","Queen Bianco/Rosso",70,null,null,null,null,68.900000000000006,128,66.3,124,null,null,70.900000000000006,123,68,118]
["PARCO ROMA Castello",573,"PARCO ROMA","Castello",72,null,null,73.400000000000006,139,72.2,139,69.400000000000006,133,76.3,140,73.8,133,70.7,126]
["PARCO ROMA Castello 1°Nove",574,"PARCO ROMA","Castello 1°Nove",36,null,null,null,null,35.5,138,34,127,null,null,36.5,129,35,120]
["PARCO ROMA Castello 2°Nove",575,"PARCO ROMA","Castello 2°Nove",36,null,null,null,null,36.700000000000003,140,35.1,129,null,null,37.299999999999997,137,35.799999999999997,128]
["PARCO ROMA Misto",576,"PARCO ROMA","Misto",72,null,null,null,null,72.400000000000006,139,69,131,null,null,73.8,134,70.8,128]
["PARCO ROMA Misto 4-->12",{"$f":"1+B580","v":577},"PARCO ROMA","Misto 4-->12",72,null,null,null,null,72,139,69.2,129,null,null,73.8,132,70.8,126]
["PARCO ROMA Prime Nove Summer",578,"PARCO ROMA","Prime Nove Summer",36,null,null,null,null,35.5,138,34,127,null,null,36.5,129,35,120]
["PARCO ROMA Summer (17=1)",579,"PARCO ROMA","Summer (17=1)",72,null,null,73.400000000000006,139,72.2,139,69.400000000000006,133,76.3,140,73.8,133,70.7,126]
["PASSIRIA MERANO 18 Buche",580,"PASSIRIA MERANO","18 Buche",71,null,null,72.5,138,71,135,67.7,127,74.7,139,73,130]
["PASSIRIA MERANO Prime Nove",581,"PASSIRIA MERANO","Prime Nove",35,null,null,null,null,34.5,130,null,null,null,null,35.4,127]
["PASSIRIA MERANO Seconde Nove",582,"PASSIRIA MERANO","Seconde Nove",36,null,null,null,null,36.5,140,null,null,null,null,37.6,133]
["PAVONIERE 18 Buche",583,"PAVONIERE","18 Buche",72,null,null,74.7,140,73,139,70,130,77.099999999999994,145,74.900000000000006,139,71.7,132]
["PAVONIERE 18 buche short",584,"PAVONIERE","18 buche short",72,null,null,74.7,140,72.2,138,70,133,77.099999999999994,145,74.8,139,71.7,132]
["PAVONIERE 2 volte le seconde nove",585,"PAVONIERE","2 volte le seconde nove",72,null,null,null,null,73.2,142,70.2,134,null,null,75,140,71.8,133]
["PAVONIERE prime 9 short 2 volte",586,"PAVONIERE","prime 9 short 2 volte",72,null,null,74.400000000000006,136,71.8,133,70,130,77,144,74.599999999999994,137,71.599999999999994,131]
["PAVONIERE Prime Nove",587,"PAVONIERE","Prime Nove",36,null,null,37.200000000000003,136,36.4,135,34.9,126,38.5,144,37.4,138,35.799999999999997,131]
["PAVONIERE prime nove sh",588,"PAVONIERE","prime nove sh",36,null,null,37.200000000000003,136,35.9,133,35,130,38.5,144,37.299999999999997,137,35.799999999999997,131]
[{"$f":"_xlfn.TEXTJOIN(\" \",TRUE,C593:D593)","v":"PAVONIERE seconde 9 short 2 volte"},589,"PAVONIERE","seconde 9 short 2 volte",72,null,null,75,144,72.599999999999994,142,70.099999999999994,136,77.2,146,75,140,71.400000000000006,132]
["PAVONIERE Seconde Nove",590,"PAVONIERE","Seconde Nove",36,null,null,37.5,144,36.6,142,35.1,134,38.6,146,37.5,140,35.9,133]
["PAVONIERE seconde nove sh",591,"PAVONIERE","seconde nove sh",36,null,null,37.5,144,36.299999999999997,142,35,136,38.6,146,37.5,140,35.9,133]
["PERUGIA Percorso Par 72",592,"PERUGIA","Percorso Par 72",72,null,null,null,null,71,125,67.2,116,null,null,72.7,122,69.5,117]
["PERUGIA Prime Nove",593,"PERUGIA","Prime Nove",38,null,null,null,null,37.200000000000003,133,35.5,129,null,null,37.9,130,36.200000000000003,126]
["PERUGIA provv 2018 18 buche",594,"PERUGIA","provv 2018 18 buche",72,null,null,null,null,70,122,67.3,116,null,null,71.8,118,69.3,116]
["PERUGIA Seconde Nove",595,"PERUGIA","Seconde Nove",34,null,null,null,null,33.799999999999997,117,32.5,114,null,null,34.799999999999997,114,33.299999999999997,111]
["PETERSBERG 18 Buche",596,"PETERSBERG","18 Buche",71,null,null,null,null,70.400000000000006,127,68.2,122,null,null,70.8,128,68.5,123]
["PETERSBERG Prime Nove",597,"PETERSBERG","Prime Nove",36,null,null,null,null,36,130,null,null,null,null,36,133]
["PETERSBERG Seconde Nove",598,"PETERSBERG","Seconde Nove",35,null,null,null,null,34.4,123,null,null,null,null,34.799999999999997,123]
["PEVERO 18 Buche",599,"PEVERO","18 Buche",72,null,null,75.3,141,73.5,140,71.400000000000006,135,76.900000000000006,146,74.5,140,72.2,135]
["PEVERO Prime Nove",600,"PEVERO","Prime Nove",36,null,null,37.9,140,36.9,140,35.799999999999997,135,38.6,145,37.299999999999997,137,36.200000000000003,132]
["PEVERO Seconde Nove",601,"PEVERO","Seconde Nove",36,null,null,37.4,143,36.6,140,35.6,135,38.299999999999997,148,37.200000000000003,144,36,139]
["PICCIOLO 18 Buche",602,"PICCIOLO","18 Buche",72,null,null,72.5,136,70.599999999999994,133,69.2,130,74,122,72.599999999999994,119,71.7,117]
["PICCIOLO Prime Nove",603,"PICCIOLO","Prime Nove",36,null,null,35.4,134,34.200000000000003,129,33.5,126,36.1,121,35.4,118,35,116]
["PICCIOLO Seconde Nove",604,"PICCIOLO","Seconde Nove",36,null,null,37.1,137,36.4,136,35.6,133,37.9,123,37.200000000000003,120,36.799999999999997,118]
["PINEROLO Prag.1 5bis 9 b",605,"PINEROLO","Prag.1 5bis 9 b",36,null,null,35.299999999999997,139,34,137,32.9,131,36.1,137,35.299999999999997,138,33.9,131]
["PINEROLO Pragelato1 5bis",606,"PINEROLO","Pragelato1 5bis",72,null,null,70.599999999999994,139,68,137,65.7,131,72.2,137,70.599999999999994,138,67.7,131]
["PINEROLO Pragelato2",607,"PINEROLO","Pragelato2",72,null,null,70.599999999999994,140,68.2,138,65.8,132,72.400000000000006,139,70.8,140,67.900000000000006,133]
["PINEROLO Pragelato2 9 b",608,"PINEROLO","Pragelato2 9 b",36,null,null,35.299999999999997,140,34.1,138,32.9,132,36.200000000000003,139,35.4,140,34,133]
["PINETINA 18 Buche",609,"PINETINA","18 Buche",70,null,null,71.7,128,70.5,126,67.900000000000006,120,73.900000000000006,125,72.3,122,69.5,116]
["PINETINA 18 Buche Par 71",610,"PINETINA","18 Buche Par 71",71,null,null,71.900000000000006,128,70.599999999999994,126,68.099999999999994,121,74.2,126,72.599999999999994,123,69.8,117]
["PINETINA Prime Nove",611,"PINETINA","Prime Nove",36,null,null,36,131,35.4,129,34.200000000000003,124,37.4,127,36.6,124,35.299999999999997,119]
["PINETINA Seconde Nove",612,"PINETINA","Seconde Nove",34,null,null,35.700000000000003,124,35.1,122,33.700000000000003,116,36.5,123,35.700000000000003,120,34.200000000000003,114]
["PINETINA Seconde Nove Par 35",613,"PINETINA","Seconde Nove Par 35",35,null,null,35.9,125,35.200000000000003,123,33.9,117,36.799999999999997,124,36,121,34.5,115]
["POGGIO MEDICI 18 Buche",614,"POGGIO MEDICI","18 Buche",72,null,null,74.400000000000006,135,72.7,131,null,null,76.5,134,74.599999999999994,131]
["POGGIO MEDICI 2018",615,"POGGIO MEDICI",2018,73,null,null,74.7,139,73.400000000000006,134,70.8,128,76.7,137,75.599999999999994,134,72.599999999999994,128]
["POGGIO MEDICI Par 73",616,"POGGIO MEDICI","Par 73",73,null,null,74.7,138,73.400000000000006,133,71,127,76.2,133,75,133,71.900000000000006,127]
["POGGIO MEDICI Prime Nove",617,"POGGIO MEDICI","Prime Nove",36,null,null,37.1,134,36.200000000000003,125,null,null,37.799999999999997,132,36.9,130]
["POGGIO MEDICI Prime Nove Buche Par 37",618,"POGGIO MEDICI","Prime Nove Buche Par 37",37,null,null,null,null,37.1,130,null,null,null,null,37.5,130]
["POGGIO MEDICI Seconde Nove",619,"POGGIO MEDICI","Seconde Nove",36,null,null,37.200000000000003,136,36.6,136,null,null,38.700000000000003,136,37.700000000000003,132]
["PONTE LEGNO 18 Buche",620,"PONTE LEGNO","18 Buche",70,null,null,null,null,68.2,130,65.3,123,null,null,70.3,140,68.3,136]
["PONTE LEGNO Nove Buche",621,"PONTE LEGNO","Nove Buche",35,null,null,null,null,34.1,130,32.700000000000003,127,null,null,35.299999999999997,141,34.1,139]
["PORDENONE 18 buche 2018",622,"PORDENONE","18 buche 2018",72,null,null,null,null,71.099999999999994,127,67.599999999999994,118,null,null,71.2,123,66.8,114]
["PORDENONE 18 buche 2019",623,"PORDENONE","18 buche 2019",72,null,null,null,null,71.2,127,67.599999999999994,118,null,null,71.599999999999994,124,66.8,114]
["PORDENONE prime nove 2018",624,"PORDENONE","prime nove 2018",36,null,null,35.9,1.32,35.6,1.29,33.799999999999997,1.21,36.4,1.32,35.799999999999997,1.29,33.6,1.2]
["PORDENONE prime nove 2019",625,"PORDENONE","prime nove 2019",36,null,null,null,null,36.700000000000003,129,33.799999999999997,121,null,null,35.9,130,33.6,120]
["PORDENONE seconde 9 2018",626,"PORDENONE","seconde 9 2018",36,null,null,35.9,125,35.6,123,33.6,114,36.1,120,35.5,117,33.299999999999997,108]
["PORDENONE seconde nove 2019",627,"PORDENONE","seconde nove 2019",36,null,null,null,null,35.700000000000003,123,33.6,114,null,null,35.6,118,33.299999999999997,108]
["PRIMULE 18 buche",628,"PRIMULE","18 buche",62,null,null,62.6,118,62.4,116,60.6,112,62.6,116,62,114,62,114]
["PRIMULE Nove Buche",629,"PRIMULE","Nove Buche",31,null,null,31.3,118,31.2,116,30.3,112,31.3,116,31,114]
["PUNTA ALA 18 Buche",630,"PUNTA ALA","18 Buche",72,null,null,73.8,140,73.3,139,70.400000000000006,132,73.900000000000006,137,73.7,136,72.599999999999994,134]
["PUNTA ALA Prime Nove",631,"PUNTA ALA","Prime Nove",36,null,null,37.200000000000003,144,36.799999999999997,143,35.4,136,37.299999999999997,140,37.200000000000003,139,36.6,137]
["PUNTA ALA Seconde Nove",632,"PUNTA ALA","Seconde Nove",36,null,null,36.6,137,36.4,136,35,128,36.6,133,36.5,133,36,131]
["PUNTALDIA 18 Buche",633,"PUNTALDIA","18 Buche",60,null,null,null,null,62.6,105,58.9,96,null,null,62,97,62,97]
["PUNTALDIA 9 buche",634,"PUNTALDIA","9 buche",30,null,null,null,null,31.3,105,29.4,96,null,null,31,97]
["PUSTERTAL 18 Buche",{"$f":"1+B638","v":635},"PUSTERTAL","18 Buche",68,null,null,69.900000000000006,132,69.2,127,66.7,121,71.900000000000006,132,69.400000000000006,126,66.5,120]
["PUSTERTAL 9 buche 2021",636,"PUSTERTAL","9 buche 2021",33,null,null,34.4,136,34.1,131,33.4,125,35.6,135,34.299999999999997,129,32.799999999999997,123]
["PUSTERTAL 18 Buche 2021",{"$f":"1+B640","v":637},"PUSTERTAL","18 Buche 2021",66,null,null,68.8,136,68.2,131,66.8,125,71.2,135,68.599999999999994,129,65.599999999999994,123]
["PUSTERTAL Prime Nove",638,"PUSTERTAL","Prime Nove",34,null,null,null,null,34.6,127,33.4,124,null,null,34.700000000000003,126,33.299999999999997,123]
["PUSTERTAL Seconde Nove",639,"PUSTERTAL","Seconde Nove",34,null,null,null,null,34.6,127,33.4,124,null,null,34.700000000000003,126,33.299999999999997,123]
["RAPALLO 9 buche giro corto",640,"RAPALLO","9 buche giro corto",34,null,null,33.9,118,33.5,116,32.299999999999997,110,34.9,122,34.700000000000003,120,33.200000000000003,114]
["RAPALLO B.1 Par3 B.5 Rid. PAR 69",{"$f":"1+B644","v":641},"RAPALLO","B.1 Par3 B.5 Rid. PAR 69",69,null,null,null,null,68.8,120,null,null,null,null,70.599999999999994,124]
["RAPALLO B.5 Rid. Par 69",642,"RAPALLO","B.5 Rid. Par 69",69,null,null,68.900000000000006,120,68,118,65.099999999999994,111,70.7,125,69.900000000000006,122]
["RAPALLO B.5 Rid. Par 70",643,"RAPALLO","B.5 Rid. Par 70",70,null,null,70.599999999999994,123,69.400000000000006,121,66.400000000000006,114,72.5,127,71.3,125,68.7,119]
["RAPALLO Misto 9 buche",644,"RAPALLO","Misto 9 buche",35,null,null,null,null,34.200000000000003,119,33.299999999999997,114,null,null,34.700000000000003,121]
["RAPALLO Prime Nove B.5 Rid. Par 70",645,"RAPALLO","Prime Nove B.5 Rid. Par 70",36,null,null,null,null,34.9,128,33.6,122,null,null,35.799999999999997,132,34.299999999999997,126]
["REGGIO EMILIA Percorso gare 18 buche",646,"REGGIO EMILIA","Percorso gare 18 buche",58,null,null,null,null,57.4,86,57.4,86,null,null,57.6,81,57.6,81]
["REGGIO EMILIA Percorso Gare 9 buche",647,"REGGIO EMILIA","Percorso Gare 9 buche",29,null,null,null,null,28.7,86,null,null,null,null,28.8,81]
["RENDENA 18 Buche",648,"RENDENA","18 Buche",70,null,null,null,null,68.599999999999994,133,66.099999999999994,127,null,null,70.900000000000006,127,68.3,122]
["RENDENA Prime Nove",649,"RENDENA","Prime Nove",35,null,null,null,null,34.299999999999997,133,33,130,null,null,35.5,127,34.299999999999997,124]
["RENDENA Seconde Nove",650,"RENDENA","Seconde Nove",35,null,null,null,null,34.299999999999997,133,null,null,null,null,35.5,127]
["RIETI 18 Buche",651,"RIETI","18 Buche",70,null,null,null,null,68.599999999999994,124,68.599999999999994,118,null,null,70.599999999999994,125,68.400000000000006,120]
["RIETI Nove Buche",652,"RIETI","Nove Buche",35,null,null,null,null,34.299999999999997,124,null,null,null,null,35.299999999999997,125]
["RIMINI VERUCCHIO 18 Buche",653,"RIMINI VERUCCHIO","18 Buche",72,null,null,72,131,70,127,66.900000000000006,120,73.900000000000006,130,72.099999999999994,127]
["RIMINI VERUCCHIO Nove Buche\n1-2-3-10-14...18",654,"RIMINI VERUCCHIO","Nove Buche\n1-2-3-10-14...18",37,null,null,36.5,136,35.5,132,32.4,118,37.4,130,36.700000000000003,127]
[{"$f":"_xlfn.TEXTJOIN(\" \",TRUE,C659:D659)","v":"RIMINI VERUCCHIO Nove Buche Executive"},655,"RIMINI VERUCCHIO","Nove Buche Executive",29,null,null,null,null,28.7,100,null,null,null,null,27.9,97]
["RIMINI VERUCCHIO Prime Nove",656,"RIMINI VERUCCHIO","Prime Nove",37,null,null,37.1,127,36,124,34.200000000000003,116,38.299999999999997,133,37.200000000000003,129]
["RIMINI VERUCCHIO Seconde Nove",657,"RIMINI VERUCCHIO","Seconde Nove",35,null,null,34.9,135,34,130,32.700000000000003,124,35.6,126,34.9,124]
["RIVIERA GOLF 18 Buche",658,"RIVIERA GOLF","18 Buche",70,null,null,72.400000000000006,128,70.099999999999994,122,66.900000000000006,115,73.900000000000006,132,70.3,126,67.5,120]
["RIVIERA GOLF invernale 18 buche",659,"RIVIERA GOLF","invernale 18 buche",72,null,null,74.8,135,72,129,69.2,123,77.2,138,74.2,132,71.2,126]
["RIVIERA GOLF invernale 9 buche",660,"RIVIERA GOLF","invernale 9 buche",36,null,null,37.4,135,36,129,34.6,123,38.6,138,37.1,132,35.6,126]
["RIVIERA GOLF Prime Nove",661,"RIVIERA GOLF","Prime Nove",36,null,null,36.700000000000003,130,35.6,125,33.799999999999997,117,37.200000000000003,131,36,126,34,122]
["RIVIERA GOLF Seconde Nove",662,"RIVIERA GOLF","Seconde Nove",34,null,null,35.700000000000003,126,34.5,118,33.1,113,36.700000000000003,132,35.299999999999997,126,33.5,118]
["ROBINIE 18 Buche",663,"ROBINIE","18 Buche",72,null,null,73.7,130,71.7,125,69.900000000000006,121,76.2,129,73.7,123,70.5,116]
["ROBINIE Invernale (1-4-11 green provv)",664,"ROBINIE","Invernale (1-4-11 green provv)",72,null,null,null,null,71.099999999999994,125,null,null,null,null,72.900000000000006,124]
["ROBINIE Invernale Prime Nove",665,"ROBINIE","Invernale Prime Nove",36,null,null,null,null,35,128,null,null,null,null,35.799999999999997,120]
["ROBINIE Invernale Seconde Nove",666,"ROBINIE","Invernale Seconde Nove",36,null,null,null,null,36.1,122,null,null,null,null,37.1,128]
["ROBINIE Prime Nove",667,"ROBINIE","Prime Nove",36,null,null,36.5,131,35.6,126,34.700000000000003,122,37.700000000000003,126,36.4,121,35,115]
["ROBINIE Seconde Nove",668,"ROBINIE","Seconde Nove",36,null,null,37.200000000000003,129,36.200000000000003,124,35.200000000000003,119,38.5,133,37.200000000000003,127,35.4,117]
["ROMA ACQUASANTA 18 Buche",669,"ROMA ACQUASANTA","18 Buche",71,null,null,71.8,135,70.7,131,67.900000000000006,124,73.7,133,72.3,132,69.900000000000006,127]
["ROMA ACQUASANTA Prime Nove",670,"ROMA ACQUASANTA","Prime Nove",35,null,null,35.5,134,34.799999999999997,127,33.4,124,36.4,134,35.700000000000003,130,34.4,127]
["ROMA ACQUASANTA Seconde Nove",671,"ROMA ACQUASANTA","Seconde Nove",36,null,null,36.299999999999997,137,35.9,135,34.5,132,37.299999999999997,132,36.700000000000003,133]
["RONCEGNO 18 buche",672,"RONCEGNO","18 buche",66,null,null,null,null,65,112,63.2,111,null,null,65.8,116,65.8,116]
["RONCEGNO 9 buche",673,"RONCEGNO","9 buche",33,null,null,null,null,32.5,112,31.6,111,null,null,32.9,116,32.9,116]
["ROSSERA 18 Buche",674,"ROSSERA","18 Buche",70,null,null,null,null,68.599999999999994,123,65.5,116,null,null,70.900000000000006,122]
["ROSSERA Prime Nove",675,"ROSSERA","Prime Nove",35,null,null,null,null,34.299999999999997,123,32.799999999999997,116,null,null,35.5,122]
["ROSSERA Seconde Nove",676,"ROSSERA","Seconde Nove",35,null,null,null,null,34.299999999999997,123,null,null,null,null,35.5,122]
["ROVEDINE 18 Buche",677,"ROVEDINE","18 Buche",72,null,null,72.8,126,72.2,124,68.5,116,74.2,124,73.599999999999994,123]
["ROVEDINE 9 buche invernali",678,"ROVEDINE","9 buche invernali",36,null,null,null,null,36,127,34.200000000000003,119,null,null,36.5,122]
["ROVEDINE Nuove Buche",679,"ROVEDINE","Nuove Buche",36,null,null,null,null,36.5,122,34.6,113,null,null,37.6,123]
["ROVEDINE Prime Nove",680,"ROVEDINE","Prime Nove",36,null,null,null,null,36.700000000000003,127,34.799999999999997,118,null,null,37.299999999999997,125]
["ROVEDINE Seconde Nove",681,"ROVEDINE","Seconde Nove",36,null,null,null,null,35.6,120,33.9,112,null,null,36.299999999999997,121]
["ROVEDINE Vecchie Buche",682,"ROVEDINE","Vecchie Buche",36,null,null,null,null,35.6,124,33.9,116,null,null,35.799999999999997,126]
["ROVIGOLF 18 Buche",683,"ROVIGOLF","18 Buche",56,null,null,null,null,57.6,94,57.6,94,null,null,59.6,97,59.6,97]
["ROVIGOLF Nove Buche",684,"ROVIGOLF","Nove Buche",28,null,null,null,null,28.8,94,28.8,94,null,null,29.8,97]
["ROYAL PARK ROVERI Hurdzan Fry",685,"ROYAL PARK ROVERI","Hurdzan Fry",72,null,null,74.599999999999994,140,72.3,136,69.3,129,77,137,74.5,134,71.099999999999994,127]
["ROYAL PARK ROVERI Hurdzan Fry 10-18",686,"ROYAL PARK ROVERI","Hurdzan Fry 10-18",36,null,null,37.799999999999997,137,36.6,132,35.1,125,38.6,135,37.5,134,35.799999999999997,127]
["ROYAL PARK ROVERI Hurdzan Fry 1-9",687,"ROYAL PARK ROVERI","Hurdzan Fry 1-9",36,null,null,36.799999999999997,143,35.700000000000003,139,34.200000000000003,132,38.4,138,37,134,35.299999999999997,127]
["ROYAL PARK ROVERI Trent Jones",688,"ROYAL PARK ROVERI","Trent Jones",72,null,null,74.7,143,73.3,138,70.3,131,76.599999999999994,136,75,133,71.900000000000006,127]
["ROYAL PARK ROVERI Trent Jones Prime Nove",689,"ROYAL PARK ROVERI","Trent Jones Prime Nove",36,null,null,37.1,151,36.299999999999997,147,34.799999999999997,144,38.1,144,37.200000000000003,140,35.6,137]
["ROYAL PARK ROVERI Trent Jones Seconde Nove",690,"ROYAL PARK ROVERI","Trent Jones Seconde Nove",36,null,null,37.6,133,36.9,130,35.4,126,38.5,129,37.799999999999997,126,36.4,123]
["SALERNO 18 BUCHE",691,"SALERNO","18 BUCHE",68,null,null,64.8,112,63.4,109,61.9,105,67.599999999999994,118,66.400000000000006,115]
["SALERNO 18 BUCHE DOPPIE PARTENZE",692,"SALERNO","18 BUCHE DOPPIE PARTENZE",68,null,null,null,null,64.099999999999994,111,61.9,105,null,null,67,117]
["SALERNO 9 BUCHE",693,"SALERNO","9 BUCHE",34,null,null,32.4,112,31.7,109,31,105,33.799999999999997,118,33.200000000000003,115]
["SALICE TERME 18 Buche",694,"SALICE TERME","18 Buche",70,null,null,null,null,68.2,121,64.900000000000006,113,null,null,69.8,124,65.8,116]
["SALICE TERME Prime Nove",695,"SALICE TERME","Prime Nove",35,null,null,null,null,34.200000000000003,121,32.6,117,null,null,35.1,125,33.1,121]
["SALICE TERME Seconde Nove",696,"SALICE TERME","Seconde Nove",35,null,null,null,null,34,120,null,null,null,null,34.700000000000003,123]
["SALICI 18 buche",697,"SALICI","18 buche",60,null,null,null,null,58.4,102,57.4,100,null,null,58.4,101]
["SALICI 9 buche",698,"SALICI","9 buche",30,null,null,null,null,29.2,102,28.7,100,null,null,29.2,101]
["SALSOMAGGIORE TERME 18 Buche",699,"SALSOMAGGIORE TERME","18 Buche",72,null,null,null,null,70.900000000000006,132,67.7,125,null,null,72.7,124,68.8,116]
["SALSOMAGGIORE TERME Prime Nove",700,"SALSOMAGGIORE TERME","Prime Nove",36,null,null,null,null,35.299999999999997,134,33.799999999999997,131,null,null,36.299999999999997,127,34.5,123]
["SALSOMAGGIORE TERME Seconde Nove",701,"SALSOMAGGIORE TERME","Seconde Nove",36,null,null,null,null,35.6,130,33.9,126,null,null,36.5,121,34.5,117]
["SALUZZO 18 Buche",702,"SALUZZO","18 Buche",72,null,null,72.8,132,72.2,132,68.5,123,74.599999999999994,128,73.599999999999994,126,69.7,118]
["SALUZZO 2020 doppie partenze",703,"SALUZZO","2020 doppie partenze",72,null,null,null,null,72.5,132,68.5,123,null,null,74.099999999999994,127,69.7,118]
["SALUZZO Nove Buche",704,"SALUZZO","Nove Buche",36,null,null,36.4,132,36.1,132,34.299999999999997,123,37.299999999999997,128,36.799999999999997,126,34.9,118]
["SAN DOMENICO - EGNAZIA 18 Buche",{"$f":"1+B708","v":705},"SAN DOMENICO - EGNAZIA","18 Buche",72,null,null,73.7,133,71.3,128,67.099999999999994,118,73.3,130,71.099999999999994,128,67.099999999999994,120]
["SAN DOMENICO - EGNAZIA Prime Nove",706,"SAN DOMENICO - EGNAZIA","Prime Nove",37,null,null,null,null,36.6,131,34.799999999999997,125,null,null,36.6,130]
["SAN DOMENICO - EGNAZIA Seconde Nove",707,"SAN DOMENICO - EGNAZIA","Seconde Nove",35,null,null,null,null,34.799999999999997,125,33,119,null,null,34.6,125]
["SAN DONATO 18 buche 2015",708,"SAN DONATO","18 buche 2015",68,null,null,null,null,67,127,64.400000000000006,121,null,null,68.2,129,68.2,129]
["SAN DONATO Prime Nove",709,"SAN DONATO","Prime Nove",35,null,null,null,null,33.5,123,32.5,118,null,null,34.5,127,34.5,127]
["SAN DONATO Seconde Nove",710,"SAN DONATO","Seconde Nove",33,null,null,null,null,33.5,131,31.9,124,null,null,33.700000000000003,131,33.700000000000003,131]
["SAN GIOVANNI BOSCHI 18 Buche",711,"SAN GIOVANNI BOSCHI","18 Buche",72,null,null,70.3,136,69,133,65.400000000000006,125,71.599999999999994,128,68.7,122,66.400000000000006,117]
["SAN GIOVANNI BOSCHI Prime Nove",712,"SAN GIOVANNI BOSCHI","Prime Nove",36,null,null,35.1,136,34.5,133,32.700000000000003,129,35.799999999999997,128,34.4,122,33.200000000000003,120]
["SAN MICHELE 18 Buche",713,"SAN MICHELE","18 Buche",70,null,null,null,null,68.8,126,65.5,118,null,null,69.400000000000006,121]
["SAN MICHELE Nove Buche",714,"SAN MICHELE","Nove Buche",35,null,null,null,null,34.4,126,32.799999999999997,118,null,null,34.700000000000003,121]
["SAN MINIATO 18 Buche",715,"SAN MINIATO","18 Buche",62,null,null,null,null,62,100,61.1,98,null,null,62.7,98,62.7,98]
["SAN MINIATO Prime Nove",716,"SAN MINIATO","Prime Nove",31,null,null,null,null,31,100,31,100,null,null,31.4,98]
["SAN MINIATO Seconde Nove",717,"SAN MINIATO","Seconde Nove",31,null,null,null,null,31,100,31,100,null,null,31.4,98]
["SAN VALENTINO 1° Nove P.72",718,"SAN VALENTINO","1° Nove P.72",36,null,null,null,null,38.299999999999997,135,36.5,127,null,null,38.1,137]
[{"$f":"_xlfn.TEXTJOIN(\" \",TRUE,C723:D723)","v":"SAN VALENTINO 18 Buche"},719,"SAN VALENTINO","18 Buche",69,null,null,70.3,126,69.599999999999994,126,66.400000000000006,119,70,119,69.099999999999994,117]
["SAN VALENTINO 2° Nove P.72",720,"SAN VALENTINO","2° Nove P.72",36,null,null,null,null,36.4,136,null,null,null,null,35.799999999999997,123]
["SAN VALENTINO Par 72",721,"SAN VALENTINO","Par 72",72,null,null,75.400000000000006,137,74.7,136,71.099999999999994,128,74.8,131,73.900000000000006,130,71.099999999999994,124]
["SAN VALENTINO Prime Nove",722,"SAN VALENTINO","Prime Nove",33,null,null,null,null,33.200000000000003,115,31.9,109,null,null,33.299999999999997,111]
["SAN VALENTINO Seconde Nove",723,"SAN VALENTINO","Seconde Nove",36,null,null,null,null,36.4,136,34.6,128,null,null,35.799999999999997,123]
["SAN VIGILIO Benaco",724,"SAN VIGILIO","Benaco",36,null,null,36.799999999999997,123,36.200000000000003,121,34.6,117,36.799999999999997,120,36.200000000000003,117,34.6,114]
["SAN VIGILIO Benaco-San Mar.",725,"SAN VIGILIO","Benaco-San Mar.",71,null,null,72.099999999999994,125,71.099999999999994,123,67.900000000000006,116,72.7,122,70.8,118,67.7,111]
["SAN VIGILIO Benaco-Solfer.",726,"SAN VIGILIO","Benaco-Solfer.",72,null,null,73.2,126,71.7,124,68.2,116,72.599999999999994,121,71.599999999999994,119,68.400000000000006,112]
["SAN VIGILIO San Martino",727,"SAN VIGILIO","San Martino",35,null,null,35.299999999999997,126,34.9,125,33.4,121,35.9,124,34.6,119,33.1,116]
["SAN VIGILIO Solfer.-San Mar",728,"SAN VIGILIO","Solfer.-San Mar",71,null,null,71.7,127,70.400000000000006,126,67,118,71.7,123,70,120,67,114]
["SAN VIGILIO Solferino",729,"SAN VIGILIO","Solferino",36,null,null,36.4,128,35.5,126,33.6,122,35.799999999999997,121,35.4,120,33.9,117]
["SAN VITO 9 buche",730,"SAN VITO","9 buche",30,null,null,null,null,28.9,98,null,null,null,null,29.4,98]
["SAN VITO 18 BUCHE 2017",731,"SAN VITO","18 BUCHE 2017",64,null,null,null,null,62,114,59.9,109,null,null,63.4,120,60.8,115]
["SAN VITO 9 BUCHE 2017",732,"SAN VITO","9 BUCHE 2017",32,null,null,null,null,31,114,29.9,112,null,null,31.7,120,30.4,117]
["SANREMO ULIVI 18 Buche",733,"SANREMO ULIVI","18 Buche",69,null,null,68.7,119,68.7,119,66.2,113,71,120,71,120,68.2,114]
["SANREMO ULIVI 9 buche 1-4 14-18",734,"SANREMO ULIVI","9 buche 1-4 14-18",35,null,null,34.6,113,null,null,null,null,35.700000000000003,125]
["SANREMO ULIVI Prime Nove",735,"SANREMO ULIVI","Prime Nove",34,null,null,33,120,33,120,31.9,115,34,120,34,120,32.6,115]
["SANREMO ULIVI Seconde Nove",736,"SANREMO ULIVI","Seconde Nove",35,null,null,34.9,112,34.9,112,33.6,106,36,116,36,116,34.6,112]
["SANTA MARIA MAGGIORE 18 Buche (1 par 3)",737,"SANTA MARIA MAGGIORE","18 Buche (1 par 3)",58,null,null,null,null,60.2,101,59.1,98,null,null,60.4,106,60.4,106]
["SANTA MARIA MAGGIORE 18 Buche (1 par 4)",738,"SANTA MARIA MAGGIORE","18 Buche (1 par 4)",60,null,null,null,null,60.6,105,59.6,103,null,null,61.2,110]
["SANTA MARIA MAGGIORE 9 Buche (1 par 3)",739,"SANTA MARIA MAGGIORE","9 Buche (1 par 3)",29,null,null,null,null,30.1,101,29.6,98,null,null,30.2,106]
["SANTA MARIA MAGGIORE 9 Buche (1 par 4)",740,"SANTA MARIA MAGGIORE","9 Buche (1 par 4)",30,null,null,null,null,30.3,105,29.8,103,null,null,30.6,110]
["SANTO STEFANO 18 Buche",741,"SANTO STEFANO","18 Buche",64,null,null,null,null,63.6,107,61.5,102,null,null,65.5,104,65.5,104]
["SANTO STEFANO Nove Buche",742,"SANTO STEFANO","Nove Buche",32,null,null,null,null,31.8,107,30.5,101,null,null,32.799999999999997,104]
["SAPPADA 18 Buche",743,"SAPPADA","18 Buche",62,null,null,null,null,59,92,null,null,null,null,58.9,95]
["SAPPADA Prime Nove",744,"SAPPADA","Prime Nove",31,null,null,null,null,29.5,92,null,null,null,null,29.4,95]
["SAPPADA Seconde Nove",745,"SAPPADA","Seconde Nove",31,null,null,null,null,29.5,92,null,null,null,null,29.4,95]
["SATURNIA 18 Buche",746,"SATURNIA","18 Buche",72,null,null,74.5,144,72.2,140,69.3,133,75.400000000000006,143,72.2,136,69.400000000000006,130]
["SATURNIA Prime Nove",747,"SATURNIA","Prime Nove",37,null,null,null,null,36.5,136,null,null,null,null,35.700000000000003,135]
["SATURNIA Seconde Nove",748,"SATURNIA","Seconde Nove",35,null,null,null,null,35.9,146,null,null,null,null,37.200000000000003,137]
["SERRA 18 Buche",749,"SERRA","18 Buche",72,null,null,null,null,68.599999999999994,135,65.7,128,null,null,70.099999999999994,136,67.2,130]
["SERRA Prime Nove",750,"SERRA","Prime Nove",36,null,null,null,null,34.299999999999997,135,32.700000000000003,131,null,null,35,135,33.5,132]
["SERRA Seconde Nove",751,"SERRA","Seconde Nove",36,null,null,null,null,34.299999999999997,135,32.9,129,null,null,35.1,136]
["SERRAVALLE 18 Buche",752,"SERRAVALLE","18 Buche",72,null,null,null,null,72.2,131,69.7,125,null,null,74.2,129]
["SERRAVALLE Nove Buche",753,"SERRAVALLE","Nove Buche",36,null,null,null,null,36.1,131,34.9,125,null,null,37.1,129]
["SESTRIERES 18 Buche",754,"SESTRIERES","18 Buche",65,null,null,null,null,63.8,112,60.6,105,null,null,64.8,114]
["SESTRIERES prime nove",755,"SESTRIERES","prime nove",31,null,null,null,null,30.7,107,28.9,99,null,null,30.6,106]
["ST. ANNA 18 Buche",756,"ST. ANNA","18 Buche",71,null,null,71.900000000000006,133,70.099999999999994,130,67.3,124,72.5,128,70.7,124,67.8,118]
["ST. ANNA GARA NAZIONALE",757,"ST. ANNA","GARA NAZIONALE",71,null,null,70.400000000000006,132,null,null,null,null,72,127]
["ST. ANNA Mare",758,"ST. ANNA","Mare",35,null,null,36.1,127,34.9,124,null,null,36.200000000000003,126,35.200000000000003,121]
["ST. ANNA Mare 2 volte",759,"ST. ANNA","Mare 2 volte",70,null,null,72.2,127,69.8,124,null,null,72.400000000000006,126,70.400000000000006,121]
["ST. ANNA Monti",760,"ST. ANNA","Monti",36,null,null,35.799999999999997,138,35.200000000000003,135,null,null,36.299999999999997,130,35.5,127]
["ST. ANNA Monti 2 volte",761,"ST. ANNA","Monti 2 volte",72,null,null,71.599999999999994,138,70.400000000000006,135,null,null,72.599999999999994,130,71,127]
["ST. VIGIL SEIS 18 Buche",762,"ST. VIGIL SEIS","18 Buche",69,null,null,67.400000000000006,135,66.900000000000006,133,63.6,125,70.599999999999994,132,69.5,129,65.900000000000006,122]
["ST. VIGIL SEIS Prime Nove",763,"ST. VIGIL SEIS","Prime Nove",35,null,null,33.799999999999997,140,33.4,138,31.8,130,35.299999999999997,138,34.700000000000003,136,32.9,129]
["ST. VIGIL SEIS Seconde Nove",764,"ST. VIGIL SEIS","Seconde Nove",34,null,null,33.700000000000003,128,33.6,128,31.9,120,35.4,126,34.9,122,33.1,115]
["STUPINIGI 18 buche 2018 par 62",765,"STUPINIGI","18 buche 2018 par 62",62,null,null,null,null,62.2,108,61,105,null,null,62.4,99]
["STUPINIGI 18 Buche Par 64",766,"STUPINIGI","18 Buche Par 64",64,null,null,63.2,108,63.2,108,61.7,105,64.2,101,64.2,101]
["STUPINIGI 18 Buche Par 66",767,"STUPINIGI","18 Buche Par 66",66,null,null,64.599999999999994,108,64.599999999999994,108,62.9,104,65.8,111,65.8,111,65.8,111]
["STUPINIGI 9 buche 2018 par 31",768,"STUPINIGI","9 buche 2018 par 31",31,null,null,null,null,31.1,108,30.5,105,null,null,31.2,99]
["STUPINIGI 9 Buche Par 32",{"$f":"1+B772","v":769},"STUPINIGI","9 Buche Par 32",32,null,null,31.6,108,31.6,108,30.9,105,32.1,101,32.1,101]
["STUPINIGI 9 buche par 33",770,"STUPINIGI","9 buche par 33",33,null,null,32.299999999999997,108,32.299999999999997,108,31.5,104,32.9,110,32.9,110]
["STUPINIGI OLD COURSE 18B",771,"STUPINIGI","OLD COURSE 18B",66,null,null,null,null,65.2,112,62.4,105,null,null,66.8,117,66.8,117]
["STUPINIGI OLD COURSE 9B",772,"STUPINIGI","OLD COURSE 9B",33,null,null,null,null,32.6,112,31.2,105,null,null,33.4,117]
["TANKA VILLASIMIUS 18 Buche",773,"TANKA VILLASIMIUS","18 Buche",70,null,null,71.5,140,70.8,140,68.900000000000006,136,74.599999999999994,137,72.3,134,70.2,130]
["TANKA VILLASIMIUS Prime Nove",774,"TANKA VILLASIMIUS","Prime Nove",34,null,null,null,null,34.799999999999997,135,34,130,null,null,35.200000000000003,126,34.299999999999997,123]
["TANKA VILLASIMIUS Seconde Nove",775,"TANKA VILLASIMIUS","Seconde Nove",36,null,null,null,null,36,145,34.9,142,null,null,37.1,140,35.9,137]
["TARVISIO 18 buche 2013",776,"TARVISIO","18 buche 2013",70,null,null,68.900000000000006,120,68.5,119,65.2,111,70.8,124,69,121,66.5,116]
["TARVISIO 9 buche primo",777,"TARVISIO","9 buche primo",35,null,null,null,null,34.700000000000003,121,33.200000000000003,114,null,null,35.700000000000003,122,34.200000000000003,116]
["TARVISIO 9 buche secondo",778,"TARVISIO","9 buche secondo",35,null,null,null,null,33.700000000000003,118,31.9,109,null,null,33.299999999999997,118,32.200000000000003,114]
["TAURIANA Percorso 18 buche",779,"TAURIANA","Percorso 18 buche",70,null,null,null,null,68.599999999999994,115,null,null,null,null,71.2,120,71.2,120]
["TAURIANA Percorso 9 buche",780,"TAURIANA","Percorso 9 buche",35,null,null,null,null,34.299999999999997,115,null,null,null,null,35.6,120]
["TERRE CONSOLI 18 buche 2019",781,"TERRE CONSOLI","18 buche 2019",72,76.2,136,74.8,133,72.099999999999994,127,69.599999999999994,121,77.099999999999994,131,74.2,125,70.5,117]
["TERRE CONSOLI Executive PAR 31",782,"TERRE CONSOLI","Executive PAR 31",31,null,null,null,null,30.4,101,29.8,98,null,null,30.4,103,29.1,98]
[{"$f":"_xlfn.TEXTJOIN(\" \",TRUE,C787:D787)","v":"TERRE CONSOLI Executive PAR 62"},783,"TERRE CONSOLI","Executive PAR 62",62,null,null,null,null,60.8,101,59.5,98,null,null,60.8,103,58.2,98]
["TERRE CONSOLI prime 9 camp 2019",784,"TERRE CONSOLI","prime 9 camp 2019",36,null,null,37.6,137,36.5,132,35.299999999999997,126,39.1,138,37.5,131,35.9,124]
["TERRE CONSOLI seconde 9 camp 2019",785,"TERRE CONSOLI","seconde 9 camp 2019",36,null,null,37.1,130,35.6,123,34.299999999999997,117,38,124,36.700000000000003,119,34.6,110]
["TESINO 18 Buche",786,"TESINO","18 Buche",70,null,null,null,null,70.2,129,67.599999999999994,119,null,null,71.400000000000006,129,68.2,117]
["TESINO Prime Nove",787,"TESINO","Prime Nove",35,null,null,null,null,35,130,33.799999999999997,119,null,null,35.4,128,34.1,117]
["TESINO Seconde Nove",788,"TESINO","Seconde Nove",35,null,null,null,null,35.299999999999997,128,null,null,null,null,36,129]
["TIRRENIA 18 Buche",789,"TIRRENIA","18 Buche",72,null,null,null,null,72.5,132,68.900000000000006,124,null,null,75.900000000000006,138,72,130]
["TIRRENIA Misto",790,"TIRRENIA","Misto",72,null,null,null,null,72.900000000000006,127,69.099999999999994,118,null,null,75.7,133]
["TIRRENIA Nove buche",791,"TIRRENIA","Nove buche",36,null,null,null,null,36.299999999999997,132,34.5,124,null,null,38,138,36,130]
["TORINO 1° Nove Blu",792,"TORINO","1° Nove Blu",36,null,null,null,null,35.9,140,34.799999999999997,135,null,null,37.1,129,35.799999999999997,124]
["TORINO 1° Nove Giallo",793,"TORINO","1° Nove Giallo",36,null,null,null,null,36.4,140,35.200000000000003,129,null,null,37.5,133,36.299999999999997,131]
["TORINO 2° Nove Blu",794,"TORINO","2° Nove Blu",36,null,null,null,null,36.4,138,35.200000000000003,132,null,null,37.299999999999997,133,36,128]
["TORINO 2° Nove Giallo",795,"TORINO","2° Nove Giallo",36,null,null,null,null,36,134,34.9,129,null,null,37,127,35.799999999999997,122]
["TORINO Blu",796,"TORINO","Blu",72,75.099999999999994,145,73.7,142,72.3,139,69.8,133,76.599999999999994,139,74.400000000000006,131,71.8,125]
["TORINO Blu1-Giallo1",797,"TORINO","Blu1-Giallo1",72,null,null,73.400000000000006,142,72.3,140,69.900000000000006,135,76.400000000000006,137,74.5,131,72.2,126]
["TORINO Blu1-Giallo2",798,"TORINO","Blu1-Giallo2",72,null,null,73.400000000000006,134,72.099999999999994,132,70.099999999999994,128,76.599999999999994,137,74.599999999999994,131,71.8,125]
["TORINO Blu2-Giallo1",799,"TORINO","Blu2-Giallo1",72,null,null,74.099999999999994,143,72.8,141,70.2,135,76.2,137,74.7,133,72.3,128]
["TORINO Blu2-Giallo2",800,"TORINO","Blu2-Giallo2",72,null,null,74.099999999999994,135,72.599999999999994,133,70.3,128,76.400000000000006,137,74.8,133,71.900000000000006,127]
["TORINO Giallo",801,"TORINO","Giallo",72,null,null,73.8,136,72.599999999999994,133,70.2,127,76.2,135,74.900000000000006,132,72.3,127]
["TORRAZZO - CREMONA 18 Buche",802,"TORRAZZO - CREMONA","18 Buche",64,null,null,null,null,64,103,61.6,97,null,null,64.599999999999994,104,64.599999999999994,104]
["TORRAZZO - CREMONA Prime Nove",803,"TORRAZZO - CREMONA","Prime Nove",32,null,null,null,null,32,103,30.8,97,null,null,32.299999999999997,104]
["TORRAZZO - CREMONA Seconde Nove",804,"TORRAZZO - CREMONA","Seconde Nove",32,null,null,null,null,32,103,null,null,null,null,32.299999999999997,104]
["TORRE RONCHI 18 Buche",805,"TORRE RONCHI","18 Buche",72,null,null,71.2,125,71,121,67.599999999999994,113,74,131,72.599999999999994,126,69.5,119]
["TORRE RONCHI Misto I Bianchi II Gialli",806,"TORRE RONCHI","Misto I Bianchi II Gialli",72,null,null,null,null,71.099999999999994,123,67.3,114,null,null,73.3,128,69.7,121]
["TORRE RONCHI Prime Nove",807,"TORRE RONCHI","Prime Nove",36,null,null,35.6,125,35.5,121,33.799999999999997,117,37,131,36.299999999999997,126,34.700000000000003,123]
["TORRENOVA 18 Buche",808,"TORRENOVA","18 Buche",70,null,null,68,132,66.2,132,null,null,null,null,68.400000000000006,118]
["TORRENOVA 9 Buche",809,"TORRENOVA","9 Buche",35,null,null,34,132,33.1,132,null,null,null,null,34.200000000000003,118]
["TOSCANA 18 Buche",810,"TOSCANA","18 Buche",71,null,null,71.400000000000006,131,70.5,129,68,123,74.099999999999994,126,71.900000000000006,122,69.5,117]
["TOSCANA Prime Nove",811,"TOSCANA","Prime Nove",36,null,null,36.6,137,36.200000000000003,134,34.299999999999997,125,38.1,130,37,126]
["TOSCANA Seconde Nove",812,"TOSCANA","Seconde Nove",35,null,null,34.799999999999997,125,34.4,123,null,null,36,122,34.799999999999997,118]
["TRIESTE 18 Buche",813,"TRIESTE","18 Buche",70,null,null,71.7,128,70.2,126,67.2,119,74.099999999999994,124,72.599999999999994,122,69.099999999999994,115]
["TRIESTE Prime Nove",814,"TRIESTE","Prime Nove",36,null,null,35.5,128,35.200000000000003,127,33.5,119,36.9,122,36,120]
["TRIESTE Seconde Nove",815,"TRIESTE","Seconde Nove",34,null,null,36.200000000000003,128,35.1,126,33.799999999999997,120,37.200000000000003,126,36.5,125]
["UDINE 18 buche 2018",816,"UDINE","18 buche 2018",72,74.8,140,74.400000000000006,139,73,136,70.2,130,75.7,133,73.7,129,70.900000000000006,123]
["UDINE Prime Nove",817,"UDINE","Prime Nove",36,null,null,36.799999999999997,134,36.299999999999997,132,34.799999999999997,129,37.4,126,36.4,122,34.9,119]
["UDINE Seconde Nove",818,"UDINE","Seconde Nove",36,null,null,37.6,143,36.700000000000003,139,35.4,134,38.299999999999997,140,37.299999999999997,136,36.1,131]
["VALCURONE 18 Buche",819,"VALCURONE","18 Buche",71,null,null,73.3,138,72.2,136,67.3,125,74.8,130,73.8,128,71.3,123]
["VALCURONE Prime Nove",820,"VALCURONE","Prime Nove",36,null,null,36.6,141,36.1,138,33.6,127,37.299999999999997,132,36.799999999999997,130,35.5,125]
["VALCURONE Seconde Nove",821,"VALCURONE","Seconde Nove",35,null,null,36.799999999999997,134,36.200000000000003,132,33.700000000000003,121,37.5,129,37,126,35.799999999999997,121]
["VALDICHIANA 18 Buche",822,"VALDICHIANA","18 Buche",68,null,null,null,null,67.599999999999994,125,64.2,117,null,null,69,112,65.2,104]
["VALDICHIANA Nove Buche",823,"VALDICHIANA","Nove Buche",34,null,null,null,null,33.799999999999997,125,32.1,117,null,null,34.5,112,32.6,104]
["VALPESCARA 18 BUCHE 2017",824,"VALPESCARA","18 BUCHE 2017",71,null,null,null,null,68.099999999999994,118,65.2,111,null,null,70,122,66.5,115]
["VALPESCARA 18 buche laghi",825,"VALPESCARA","18 buche laghi",71,null,null,null,null,68.3,121,65.3,114,null,null,70.2,123,68.7,120]
["VALPESCARA 9b laghi",826,"VALPESCARA","9b laghi",36,null,null,null,null,34.9,128,33.299999999999997,124,null,null,35.799999999999997,129,33.9,125]
["VALPESCARA 9b piano",827,"VALPESCARA","9b piano",36,null,null,null,null,34.799999999999997,118,33.299999999999997,115,null,null,36.200000000000003,117,34.200000000000003,113]
["VALPESCARA Prime Nove",828,"VALPESCARA","Prime Nove",36,null,null,null,null,34.700000000000003,123,33.200000000000003,120,null,null,35.6,126,33.700000000000003,122]
["VALPESCARA Seconde Nove",829,"VALPESCARA","Seconde Nove",35,null,null,null,null,33.4,113,32,110,null,null,34.4,117,32.799999999999997,114]
["VALTELLINA 18 Buche",830,"VALTELLINA","18 Buche",71,null,null,71.900000000000006,132,70.3,133,66.2,124,73.5,131,71.7,129,68.599999999999994,122]
["VALTELLINA 18 Buche OLD",831,"VALTELLINA","18 Buche OLD",72,null,null,73.099999999999994,133,71.2,136,67.7,128,74.900000000000006,133,73,131]
["VALTELLINA 9 Buche OLD",832,"VALTELLINA","9 Buche OLD",36,null,null,36.5,133,35.6,136,33.6,131,37.5,133,36.5,131,34.799999999999997,124]
["VALTELLINA Prime Nove",{"$f":"1+B836","v":833},"VALTELLINA","Prime Nove",35,null,null,35.700000000000003,131,35,132,33.1,123,36.5,130,35.6,128]
["VALTELLINA Seconde Nove",834,"VALTELLINA","Seconde Nove",36,null,null,36.299999999999997,133,35.4,134,null,null,37,132,36.200000000000003,130]
["VARESE Percorso Challenge",835,"VARESE","Percorso Challenge",71,null,null,71.099999999999994,128,70.5,127,67.7,121,73.2,131,72.400000000000006,128,68.2,119]
["VARESE Prime Nove",836,"VARESE","Prime Nove",36,null,null,35.200000000000003,135,35,137,33.6,131,36.5,136,35.9,133,34.200000000000003,126]
["VARESE Prime Nove Challenge",837,"VARESE","Prime Nove Challenge",35,null,null,35,133,34.6,134,33.299999999999997,131,36,135,35.700000000000003,128,33.700000000000003,124]
["VARESE Seconde Nove",838,"VARESE","Seconde Nove",36,null,null,36.6,125,36.299999999999997,124,34.799999999999997,120,37.700000000000003,128,37.5,127,35.299999999999997,122]
["VARESE Vecchio Monast.",839,"VARESE","Vecchio Monast.",72,null,null,71.8,130,71.3,130,68.2,123,74.2,132,73.400000000000006,130,70,123]
["VENEZIA 18 Buche",840,"VENEZIA","18 Buche",72,null,null,73.400000000000006,139,72.599999999999994,138,70.2,132,75.099999999999994,133,74.7,133,72.099999999999994,128]
["VENEZIA 18 Buche Provvisorio",841,"VENEZIA","18 Buche Provvisorio",72,null,null,null,null,73.400000000000006,135,null,null,null,null,75.2,129]
["VENEZIA 2 Volte 2° Nove",842,"VENEZIA","2 Volte 2° Nove",74,null,null,null,null,75.2,146,null,null,null,null,77.599999999999994,139]
["VENEZIA 9 Buche Provvisorio",843,"VENEZIA","9 Buche Provvisorio",36,null,null,null,null,36.700000000000003,135,null,null,null,null,37.6,129]
["VENEZIA Prime Nove",844,"VENEZIA","Prime Nove",35,null,null,35.4,130,35,129,33.799999999999997,123,36.200000000000003,127,36,126,34.6,125]
["VENEZIA Seconde Nove",845,"VENEZIA","Seconde Nove",37,null,null,37.9,148,37.6,146,36.4,140,39,140,38.799999999999997,139,37.5,134]
["VERDURA East - Prime Nove",846,"VERDURA","East - Prime Nove",36,null,null,null,null,35.4,129,32.5,116,null,null,34.799999999999997,119]
[{"$f":"_xlfn.TEXTJOIN(\" \",TRUE,C851:D851)","v":"VERDURA East - Seconde Nove"},847,"VERDURA","East - Seconde Nove",36,null,null,null,null,36.9,127,33.9,113,null,null,36.4,125]
["VERDURA EAST Course",848,"VERDURA","EAST Course",72,null,null,73.900000000000006,132,72.3,128,66.5,115,75.900000000000006,132,71.2,122]
["VERDURA misto 2019",849,"VERDURA","misto 2019",70,74.900000000000006,132,73.3,128,71.900000000000006,125,68.900000000000006,118,75.400000000000006,130,71.599999999999994,122,68.8,116]
["VERDURA West - Prime Nove",850,"VERDURA","West - Prime Nove",37,null,null,null,null,37.799999999999997,135,35.299999999999997,123,null,null,38.299999999999997,143]
["VERDURA West - Seconde Nove",851,"VERDURA","West - Seconde Nove",35,null,null,null,null,35.200000000000003,135,32.6,123,null,null,34.700000000000003,127]
["VERDURA WEST Course",852,"VERDURA","WEST Course",72,null,null,74.599999999999994,139,73,135,67.900000000000006,123,76.900000000000006,143,73,135]
["VERONA 18 Buche",853,"VERONA","18 Buche",72,null,null,73.7,142,72,139,71,137,75,134,73.5,130,72.5,128]
["VERONA Prime Nove",854,"VERONA","Prime Nove",35,null,null,null,null,35,137,34.5,135,null,null,35.700000000000003,126,35.200000000000003,124]
["VERONA Seconde Nove",855,"VERONA","Seconde Nove",37,null,null,null,null,37,142,36.5,140,null,null,37.799999999999997,133,37.299999999999997,131]
["VICENZA 18 Buche",856,"VICENZA","18 Buche",72,null,null,72.599999999999994,138,71,135,67.599999999999994,127,74.2,130,72.599999999999994,127,70.900000000000006,123]
["VICENZA 18 buche misto",857,"VICENZA","18 buche misto",72,null,null,null,null,71.8,137,67.599999999999994,127,null,null,73.400000000000006,129,71,123]
["VICENZA 9 Buche",858,"VICENZA","9 Buche",36,null,null,36.299999999999997,138,35.5,135,33.799999999999997,127,37.1,130,36.299999999999997,127,35.5,123]
["VIGEVANO 18 Buche",859,"VIGEVANO","18 Buche",71,null,null,71,127,70.7,125,67.5,118,73.2,126,72.7,124,68.900000000000006,116]
["VIGEVANO Prime Nove",860,"VIGEVANO","Prime Nove",35,null,null,35,128,34.799999999999997,126,33.299999999999997,119,36.1,126,35.799999999999997,124,33.9,116]
["VIGEVANO Seconde Nove",861,"VIGEVANO","Seconde Nove",36,null,null,36,125,35.799999999999997,125,34.200000000000003,118,37,125,36.9,124,35,116]
["VIGNE 18 Buche",862,"VIGNE","18 Buche",70,null,null,70.2,124,69.099999999999994,122,66.400000000000006,116,71.599999999999994,136,70.5,129,68,124]
["VIGNE Prime 9",863,"VIGNE","Prime 9",35,null,null,34.9,120,34.4,118,33.1,112,35.9,125,35.4,123,34.1,118]
["VIGNE Seconde 9",864,"VIGNE","Seconde 9",35,null,null,35.200000000000003,127,34.700000000000003,125,33.299999999999997,118,35.700000000000003,137,35.1,134,33.799999999999997,129]
["VILLA CAROLINA Il Principe",865,"VILLA CAROLINA","Il Principe",72,null,null,72.099999999999994,129,71.099999999999994,127,67.599999999999994,119,74.5,127,72.599999999999994,124]
["VILLA CAROLINA La Marchesa",866,"VILLA CAROLINA","La Marchesa",72,null,null,74,130,72.8,130,69.5,122,75.7,124,73.900000000000006,124,70.900000000000006,118]
["VILLA CAROLINA Paradiso",867,"VILLA CAROLINA","Paradiso",72,null,null,72.400000000000006,129,70.5,126,68,120,74.3,131,72,126,69.5,121]
["VILLA CAROLINA Paradiso 9 buche",868,"VILLA CAROLINA","Paradiso 9 buche",36,null,null,null,null,34.799999999999997,126,35.6,123,null,null,35.6,123]
["VILLA CONDULMER 18 Buche (Giallo/Blu)",869,"VILLA CONDULMER","18 Buche (Giallo/Blu)",71,null,null,70.8,124,69.8,122,67.5,117,72.3,125,71.400000000000006,123,68.7,117]
["VILLA CONDULMER 9 buche Executive (Verde)",870,"VILLA CONDULMER","9 buche Executive (Verde)",29,null,null,null,null,29.9,111,28.9,107,null,null,29.7,101]
["VILLA CONDULMER Blu/Verde",871,"VILLA CONDULMER","Blu/Verde",65,null,null,null,null,66.3,120,64.2,115,null,null,66.8,118]
["VILLA CONDULMER executive 18",872,"VILLA CONDULMER","executive 18",58,null,null,null,null,59.8,111,57.8,107,null,null,59.4,101,59.4,101]
["VILLA CONDULMER Giallo/Verde",873,"VILLA CONDULMER","Giallo/Verde",64,null,null,null,null,63.3,113,61.2,109,null,null,64.2,105]
["VILLA CONDULMER Prime 9 (Giallo) 2 volte",874,"VILLA CONDULMER","Prime 9 (Giallo) 2 volte",70,null,null,67.8,117,66.8,115,64.5,110,69.8,112,68.900000000000006,110,66.2,104]
["VILLA CONDULMER Prime Nove (Giallo)",875,"VILLA CONDULMER","Prime Nove (Giallo)",35,null,null,33.9,117,33.4,115,32.299999999999997,110,34.9,112,34.5,110,33.1,104]
["VILLA CONDULMER Seconde Nove (Blu)",876,"VILLA CONDULMER","Seconde Nove (Blu)",36,null,null,36.9,128,36.4,126,35.299999999999997,121,37.5,133,37,132,35.700000000000003,126]
["VILLA D' ESTE 18 Buche",877,"VILLA D' ESTE","18 Buche",69,null,null,71,130,70,129,67.3,123,72.2,124,71.3,123,68,116]
["VILLA D' ESTE 18 buche 2019 provv",878,"VILLA D' ESTE","18 buche 2019 provv",69,null,null,null,null,69,126,66.3,120,null,null,70.3,121,67,114]
["VILLA D' ESTE 18 Buche Campionato",879,"VILLA D' ESTE","18 Buche Campionato",69,null,null,71.5,131,70,129,67.3,123,72.2,124,71.3,123,68,116]
["VILLA D' ESTE Prime Nove",880,"VILLA D' ESTE","Prime Nove",34,null,null,null,null,34.5,122,33.1,116,null,null,35.299999999999997,125,33.6,117]
["VILLA D' ESTE Seconde Nove",881,"VILLA D' ESTE","Seconde Nove",35,null,null,null,null,35.5,135,34.200000000000003,129,null,null,36.1,123,34.5,115]
["VILLA GIUSTI 18 Buche",882,"VILLA GIUSTI","18 Buche",65,null,null,null,null,63.3,105,61.6,102,null,null,65,112,65,112]
["VILLA GIUSTI Prime Nove",883,"VILLA GIUSTI","Prime Nove",31,null,null,null,null,29.7,101,29.2,99,null,null,30.2,103]
["VILLA GIUSTI Seconde Nove",884,"VILLA GIUSTI","Seconde Nove",34,null,null,null,null,33.6,109,32.4,104,null,null,34.799999999999997,120]
["VOLTURNO 18 Buche",885,"VOLTURNO","18 Buche",71,null,null,73,137,71.900000000000006,133,68.2,124,74.900000000000006,130,73.599999999999994,128,69.599999999999994,120]
["VOLTURNO 18 buche 2018",886,"VOLTURNO","18 buche 2018",68,null,null,null,null,68.2,128,64.599999999999994,120,null,null,70.400000000000006,124,67,117]
["VOLTURNO 2 volte le Prime",887,"VOLTURNO","2 volte le Prime",70,null,null,null,null,71.599999999999994,140,67.7,131,null,null,73.599999999999994,132,69.8,124]
["VOLTURNO 2 Volte Seconde",888,"VOLTURNO","2 Volte Seconde",72,null,null,null,null,72.2,125,68.599999999999994,117,null,null,73.599999999999994,123,69.5,114]
["VOLTURNO 9 buche 2018",889,"VOLTURNO","9 buche 2018",34,null,null,null,null,34.1,128,32.299999999999997,120,null,null,35.200000000000003,124,33.5,117]
["VOLTURNO 9 buche misto 2017",890,"VOLTURNO","9 buche misto 2017",36,null,null,36.299999999999997,138,35.799999999999997,135,33.799999999999997,130,37.799999999999997,130,37,126,35.200000000000003,122]
["VOLTURNO La Piana",891,"VOLTURNO","La Piana",71,null,null,71.3,125,69.3,120,null,null,72.599999999999994,124,70.5,120]
["VOLTURNO La Piana 1°nove",892,"VOLTURNO","La Piana 1°nove",35,null,null,null,null,33.799999999999997,117,null,null,null,null,34.299999999999997,121]
["VOLTURNO La Piana 2°nove",893,"VOLTURNO","La Piana 2°nove",36,null,null,null,null,35.5,122,null,null,null,null,36.1,119]
["VOLTURNO misto 2017",894,"VOLTURNO","misto 2017",72,null,null,72.7,138,71.599999999999994,135,67.7,126,75.7,130,74,126,70.099999999999994,118]
["VOLTURNO Prime Nove",895,"VOLTURNO","Prime Nove",35,null,null,null,null,35.799999999999997,140,null,null,null,null,36.799999999999997,132]
["VOLTURNO Seconde Nove",896,"VOLTURNO","Seconde Nove",36,null,null,null,null,36.1,125,null,null,null,null,36.799999999999997,123]
["ZERMAN 18 Buche",{"$f":"1+B900","v":897},"ZERMAN","18 Buche",70,null,null,null,null,70.8,124,67.400000000000006,116,null,null,72.8,123,70.3,118]
["ZERMAN Prime Nove",898,"ZERMAN","Prime Nove",35,null,null,null,null,35.5,121,33.9,117,null,null,36.5,122,35.200000000000003,119]
["ZERMAN Seconde Nove",899,"ZERMAN","Seconde Nove",35,null,null,null,null,35.299999999999997,127,33.6,119,null,null,36.299999999999997,124]
["ZOATE 18 Buche",900,"ZOATE","18 Buche",72,null,null,71.5,146,70.5,144,68.3,139,73.3,139,72.2,137,69.8,132]
["ZOATE Prime Nove",901,"ZOATE","Prime Nove",36,null,null,null,null,36.299999999999997,146,34.700000000000003,142,null,null,37.299999999999997,141,35.700000000000003,138]
["ZOATE Seconde Nove",902,"ZOATE","Seconde Nove",36,null,null,null,null,35.200000000000003,145,34.1,141,null,null,36,137,34.9,132]