{"text_format":"1","workbook":"xlsx","n_sheets":3,"sheets":["calcolo handicap","storico gare","elenco campi italiani"],"not_rendered":{"charts":0,"images":2,"macros":1,"external_links":0,"defined_names":14,"comments":0,"pivot_tables":0},"unopened":[],"bounds":{"document_bytes":16777216,"sheet_cells":100000,"rows_first":2000,"rows_last":500,"rows_between":2000,"halvings":0,"cell_chars":16384,"cell_head_chars":4096},"cells_cut":0,"cells_raw":0,"read":"whole","date_system":"1900"}

{"sheet":"calcolo handicap","index":0,"n_rows":97,"n_cols":17,"rows_kept":97,"cut":false,"hidden":false,"merged":[[21,1,21,4],[20,6,20,9],[1,2,1,4],[18,1,18,4],[9,6,9,9],[10,6,10,9],[17,6,17,9],[15,6,15,9],[16,6,16,9],[11,1,11,3],[19,6,19,9],[16,1,16,3],[22,6,22,9],[23,6,23,9],[24,6,24,9],[27,6,27,9],[28,6,28,9],[25,6,25,9],[26,6,26,9],[29,6,29,9],[30,6,30,9],[31,6,31,9],[32,6,32,9],[33,6,33,9],[39,6,39,9],[40,6,40,9],[41,6,41,9],[34,6,34,9],[35,6,35,9],[36,6,36,9],[37,6,37,9],[38,6,38,9]]}
[]
[null,"Scelta circolo e percorso","Data Gara"]
[null,"LECCO 18 Buche",null,{"$f":"TODAY()","v":"2021-04-28"}]
[null,"Scelta tee di gioco",null,"Handicap di gioco"]
[null,"giallo",null,{"$f":"IF('elenco campi italiani'!X11=0,\"NO TEE\",IF('elenco campi italiani'!AA11=9,ROUND(+(B7*'elenco campi italiani'!Y11/113+('elenco campi italiani'!X11-'elenco campi italiani'!W11)*2)/2,0),ROUND(+B7*'elenco campi italiani'!Y11/113+'elenco campi italiani'!X11-'elenco campi italiani'!W11,0)))","v":15}]
[null,"Inserire hcp attuale",null,"risultato SD"]
[null,12.4,null,{"$f":"IF(D3>44197,IF('elenco campi italiani'!X11=0,\"NO TEE\",IF('elenco campi italiani'!AA11=9,+'elenco campi italiani'!AA18,+'elenco campi italiani'!W18)),IF('elenco campi italiani'!X11=0,\"NO TEE\",IF('elenco campi italiani'!AA11=9,B7-2*('elenco campi italiani'!AA14+B11)*113/'elenco campi italiani'!Y11,B7-('elenco campi italiani'!W14+B11)*113/'elenco campi italiani'!Y11)))","v":11.885400000000002}]
[null,"Inserire risultato gara"]
[null,37]
[null,"Inserire pcc gara",null,"NUOVO HANDICAP",null,null,"Associazione  \"La Vita è un Dono\""]
[null,0,null,{"$f":"IF('storico gare'!G11=\"\",\"< 8 GARE\",IF('storico gare'!G12=\"\",SUM('storico gare'!I4:I5)/2,IF('storico gare'!G15=\"\",SUM('storico gare'!I4:I6)/3,IF('storico gare'!G18=\"\",SUM('storico gare'!I4:I7)/4,IF('storico gare'!G20=\"\",SUM('storico gare'!I4:I8)/5,IF('storico gare'!G22=\"\",SUM('storico gare'!I4:I9)/6,IF('storico gare'!G23=\"\",SUM('storico gare'!I4:I10)/7,SUM('storico gare'!I4:I11)/8)))))))","v":"< 8 GARE"},null,null,"Associazione Italiana Ingegneri Golfisti"]
[null,"PUNTEGGI MINIMI PROSSIMA GARA",null,null,null,null,null,"INFO@LAVITAEUNDONO.ORG"]
[null," PER SCENDERE",null,"PER NON SALIRE",null,null,null,"WWW.LAVITAEUNDONO.ORG"]
[null,{"$f":"IF(E24<>\"\",+C24-0.1,\"< 8 GARE\")","v":"< 8 GARE"},"SD",{"$f":"IF(E24<>20,\"qualsiasi\",+C24)","v":"qualsiasi"},null,null,null,"SEGRETERIA.AIIG@GMAIL.COM"]
[null,{"$f":"IF(E24<>\"\",IF('elenco campi italiani'!AA11=18,CEILING(-B14/'elenco campi italiani'!V11+36+D5+'elenco campi italiani'!W11-'elenco campi italiani'!X11,1),CEILING(-B14/'elenco campi italiani'!V11+19+2*D5+2*'elenco campi italiani'!W11-2*'elenco campi italiani'!X11,1)),\"< 8 GARE\")","v":"< 8 GARE"},"STB",{"$f":"IF(D14=\"qualsiasi\",D14,IF('elenco campi italiani'!AA11=18,CEILING(-D14/'elenco campi italiani'!V11+36+D5+'elenco campi italiani'!W11-'elenco campi italiani'!X11,1),CEILING(-D14/'elenco campi italiani'!V11+19+2*D5+2*'elenco campi italiani'!W11-2*'elenco campi italiani'!X11,1)))","v":"qualsiasi"},null,null,null,"WWW.ASSIIG.NET"]
[null," PER ENTRARE NEI MIGLIORI 8","STB",{"$f":"IF(E24<>\"\",IF(E24=20,IF('elenco campi italiani'!AA11=18,CEILING(-'storico gare'!I12/'elenco campi italiani'!V11+36+D5+'elenco campi italiani'!W11-'elenco campi italiani'!X11,1),CEILING(-'storico gare'!I12/'elenco campi italiani'!V11+19+2*D5+2*'elenco campi italiani'!W11-2*'elenco campi italiani'!X11,1)),B15),\"<= 8 GARE\")","v":"<= 8 GARE"},null,null,"DOMENICA 29 AGOSTO 2021"]
[null," PER FARE EXCEPTIONAL SCORE NELLA PROSSIMA GARA",null,null,{"$f":"IF('elenco campi italiani'!AA11=18,CEILING(-(B7-7)/'elenco campi italiani'!V11+36+D5+'elenco campi italiani'!W11-'elenco campi italiani'!X11,1),CEILING(-(B7-7)/'elenco campi italiani'!V11+19+2*D5+2*'elenco campi italiani'!W11-2*'elenco campi italiani'!X11,1))","v":45},null,"GOLF CLUB LECCO"]
[null,null,null,null,null,null,"XIV MEMORIAL DAVIDE CARBONE - AIIG"]
[null,"ULTIMA GARA MEMORIZZATA"]
[null,"CAMPO","SD","DATA","N",null,"per ascoltare le istruzioni per utilizzare il file"]
[null,null,null,null,null,null,"https://youtu.be/YrOqx8E-0Ug"]
[null,"PROSSIMA GARA DA SCARTARE"]
[null,"CAMPO","SD","DATA","N",null,"Aggiornamenti da versioni precedenti"]
[null,{"$f":"IF('storico gare'!F4=20,'storico gare'!H4,IF('storico gare'!F5=20,'storico gare'!H5,IF('storico gare'!F6=20,'storico gare'!H6,IF('storico gare'!F7=20,'storico gare'!H7,IF('storico gare'!F8=20,'storico gare'!H8,IF('storico gare'!F9=20,'storico gare'!H9,IF('storico gare'!F10=20,'storico gare'!H10,IF('storico gare'!G11=\"\",\"< 8 GARE\",'storico gare'!H11))))))))","v":"< 8 GARE"},{"$f":"IF('storico gare'!F4=20,'storico gare'!I4,IF('storico gare'!F5=20,'storico gare'!I5,IF('storico gare'!F6=20,'storico gare'!I6,IF('storico gare'!F7=20,'storico gare'!I7,IF('storico gare'!F8=20,'storico gare'!I8,IF('storico gare'!F9=20,'storico gare'!I9,IF('storico gare'!F10=20,'storico gare'!I10,IF('storico gare'!G11=\"\",\"\",'storico gare'!I11))))))))","v":""},{"$f":"IF('storico gare'!F4=20,'storico gare'!G4,IF('storico gare'!F5=20,'storico gare'!G5,IF('storico gare'!F6=20,'storico gare'!G6,IF('storico gare'!F7=20,'storico gare'!G7,IF('storico gare'!F8=20,'storico gare'!G8,IF('storico gare'!F9=20,'storico gare'!G9,IF('storico gare'!F10=20,'storico gare'!G10,IF('storico gare'!G11=\"\",\"< 8 GARE\",'storico gare'!G11))))))))","v":"< 8 GARE"},{"$f":"IF('storico gare'!F4=20,'storico gare'!F4,IF('storico gare'!F5=20,'storico gare'!F5,IF('storico gare'!F6=20,'storico gare'!F6,IF('storico gare'!F7=20,'storico gare'!F7,IF('storico gare'!F8=20,'storico gare'!F8,IF('storico gare'!F9=20,'storico gare'!F9,IF('storico gare'!F10=20,'storico gare'!F10,IF('storico gare'!G11=\"\",\"\",'storico gare'!F11))))))))","v":""},null,"1- calcolo SD rivisto in base all'anno della gara, "]
[null,null,null,null,null,null,"  perché da 1-1-21 l'algoritmo di calcolo è cambiato"]
[null,null,null,null,null,null,"2- aggiunto il pulsante \"Elimina Risultato Gara\" così"]
[null,null,null,null,null,null,"  vengono rimesse in ordine le gare precedenti"]
[null,null,null,null,null,null,"3- aggiunto il calcolo dell’exceptional score, che però"]
[null,null,null,null,null,null,"  non viene considerato nella media dei migliori 8"]
[null,null,null,null,null,null,"4- aggiunta la casella “Per entrare nei migliori 8” perchè, "]
[null,null,null,null,null,null,"  nel caso la gara n.20 da scartare sia anche una delle "]
[null,null,null,null,null,null,"  prime 8, manca un'informazione, cioè non basta sapere"]
[null,null,null,null,null,null,"  il valore per scendere e quello per non salire, serve "]
[null,null,null,null,null,null,"  anche sapere quale risultato ti fornisce comunque un "]
[null,null,null,null,null,null,"  SD che sia nei migliori 8, ad esempio se la gara n.20 è"]
[null,null,null,null,null,null,"  la migliore di tutte, per cui sarà scartata sicuramente, "]
[null,null,null,null,null,null,"  sapere quale risultato ti serve per evitare che il 9°"]
[null,null,null,null,null,null,"   risultato entri nei migliori 8 è comunque importante, "]
[null,null,null,null,null,null,"  almeno sai prima di giocare che con 38 scendi, con 37 "]
[null,null,null,null,null,null,"  magari non sali, ma un 30 o un 31 ti entra comunque "]
[null,null,null,null,null,null,"  nei migliori 8, per cui ha un senso anche cercare di "]
[null,null,null,null,null,null,"  imbucare l’ultimo putt alla 18 per fare 31!!!"]
[]
[]
[]
[]
[null,null,null,null,null,null,null,null,null,null,null,null,null,null,null,null,0]
[null,null,null,null,null,null,null,null,null,null,null,null,null,null,null,null,{"$f":"1+Q47","v":1}]
[null,null,null,null,null,null,null,null,null,null,null,null,null,null,null,null,{"$f":"1+Q48","v":2}]
[null,null,null,null,null,null,null,null,null,null,null,null,null,null,null,null,{"$f":"1+Q49","v":3}]
[null,null,null,null,null,null,null,null,null,null,null,null,null,null,null,null,4]
[null,null,null,null,null,null,null,null,null,null,null,null,null,null,null,null,5]
[null,null,null,null,null,null,null,null,null,null,null,null,null,null,null,null,6]
[null,null,null,null,null,null,null,null,null,null,null,null,null,null,null,null,7]
[null,null,null,null,null,null,null,null,null,null,null,null,null,null,null,null,8]
[null,null,null,null,null,null,null,null,null,null,null,null,null,null,null,null,9]
[null,null,null,null,null,null,null,null,null,null,null,null,null,null,null,null,10]
[null,null,null,null,null,null,null,null,null,null,null,null,null,null,null,null,11]
[null,null,null,null,null,null,null,null,null,null,null,null,null,null,null,null,12]
[null,null,null,null,null,null,null,null,null,null,null,null,null,null,null,null,13]
{"$rows_left_out":38}
{"sheet":"storico gare","index":1,"n_rows":1002,"n_cols":9,"rows_kept":1002,"cut":false,"hidden":false,"merged":[[1,1,1,4],[1,5,1,8]]}
[]
[null," GARE MEMORIZZATE IN ORDINE DI DATA",null,null,null,"MIGLIORI 8 RISULTATI SU 20"]
[null,"N","DATA","CAMPO","SD","N","DATA","CAMPO","SD"]
[null,1,null,null,null,1]
[null,2,null,null,null,2]
[null,3,null,null,null,3]
[null,4,null,null,null,4]
[null,5,null,null,null,5]
[null,6,null,null,null,6]
[null,7,null,null,null,7]
[null,8,null,null,null,8]
[null,9,null,null,null,9]
[null,10,null,null,null,10]
[null,11,null,null,null,11]
[null,12,null,null,null,12]
[null,13,null,null,null,13]
[null,14,null,null,null,14]
[null,15,null,null,null,15]
[null,16,null,null,null,16]
[null,17,null,null,null,17]
[null,18,null,null,null,18]
[null,19,null,null,null,19]
[null,20,null,null,null,20]
[null,21]
[null,{"$f":"1+B24","v":22}]
[null,23]
[null,24]
[null,25]
[null,26]
[null,27]
[null,28]
[null,29]
[null,30]
[null,31]
[null,32]
[null,33]
[null,34]
[null,35]
[null,36]
[null,37]
[null,38]
[null,39]
[null,40]
[null,41]
[null,42]
[null,43]
[null,44]
[null,45]
[null,46]
[null,47]
[null,48]
[null,49]
[null,50]
[null,51]
[null,52]
[null,53]
[null,54]
[null,55]
[null,56]
[null,57]
{"$rows_left_out":943}
{"sheet":"elenco campi italiani","index":2,"n_rows":906,"n_cols":27,"rows_kept":906,"cut":false,"hidden":false,"merged":[[0,0,0,18],[1,5,1,12],[1,13,1,18],[2,5,2,6],[2,7,2,8],[2,9,2,10],[2,11,2,12],[2,13,2,14],[2,15,2,16],[2,17,2,18]]}
["NB: IN ROSSO I DATI DEI CAMPI AGGIUNTI MANUALMENTE, IN QUANTO NON PRESENTI NEL FILE DELLA FEDERAZIONE",null,null,null,null,null,null,null,null,null,null,null,null,null,null,null,null,null,null,null,"hcp","tee","n. tee","UOMO/DONNA","n. pcc"]
["TOTALE PERCORSI",902,null,null,null,"TEE UOMINI",null,null,null,null,null,null,null,"TEE DONNE",null,null,null,null,null,null,-6,"nero",6,null,-1,"arancio",18]
["Nome esteso","n.","Circolo","Percorso",null,"NERO",null,"BIANCO",null,"GIALLO",null,"VERDE",null,"BLU",null,"ROSSO",null,"ARANCIO",null,null,{"$f":"ROUND(0.1+U2,1)","v":-5.9},"bianco",8,null,0,"bianco",8]
[null,null,null,null,"PAR","CR","Slope","CR","Slope","CR","Slope","CR","Slope","CR","Slope","CR","Slope","CR","Slope",null,{"$f":"ROUND(0.1+U3,1)","v":-5.8},"giallo",10,null,1,"blu",14]
[{"$f":"_xlfn.TEXTJOIN(\" \",TRUE,C5:D5)","v":"ACAYA 18 Buche Par 71"},{"$f":"1+B4","v":1},"ACAYA","18 Buche Par 71",71,null,null,73.900000000000006,136,71.8,130,68.2,122,77.400000000000006,134,73.900000000000006,127,70.900000000000006,121,null,{"$f":"ROUND(0.1+U4,1)","v":-5.7},"verde",12,null,2,"giallo",10]
[{"$f":"_xlfn.TEXTJOIN(\" \",TRUE,C6:D6)","v":"ACAYA 18 Buche Par 72"},2,"ACAYA","18 Buche Par 72",72,null,null,null,null,72.8,133,null,null,null,null,74.900000000000006,131,null,null,null,-5.6,"blu",14,"D",3,"nero",6]
["ACAYA Prime Nove",3,"ACAYA","Prime Nove",36,null,null,null,null,36.4,125,34.299999999999997,116,null,null,37.200000000000003,122,35.700000000000003,116,null,-5.5,"rosso",16,"D",null,"rosso",16]
["ACAYA Seconde Nove Par 35",4,"ACAYA","Seconde Nove Par 35",35,null,null,null,null,35.4,135,33.700000000000003,127,null,null,36.700000000000003,131,35.200000000000003,126,null,-5.4,"arancio",18,"D",null,"verde",12]
["ACAYA Seconde Nove Par 36",5,"ACAYA","Seconde Nove Par 36",36,null,null,null,null,36.4,141,null,null,null,null,37.799999999999997,137,null,null,null,-5.3]
["ACQUABONA 18 Buche",6,"ACQUABONA","18 Buche",68,null,null,null,null,68.3,131,null,null,null,null,70.599999999999994,119,null,null,null,-5.2,"113/SLOPE","PAR DEL CAMPO","CR DEL CAMPO","SR DEL CAMPO","TEE USATO","Tipo gara 9-18 buche"]
["ACQUABONA Nove Buche",7,"ACQUABONA","Nove Buche",34,null,null,null,null,34.1,131,null,null,null,null,35.299999999999997,119,null,null,null,-5.0999999999999996,{"$f":"ROUND(113/Y11,3)","v":0.83699999999999997},{"$f":"VLOOKUP('calcolo handicap'!B3,'elenco campi italiani'!$A$5:$S$906,5)","v":71},{"$f":"VLOOKUP('calcolo handicap'!B3,'elenco campi italiani'!$A$5:$S$906,Z11)","v":70.8},{"$f":"VLOOKUP('calcolo handicap'!B3,'elenco campi italiani'!$A$5:$S$906,Z11+1)","v":135},{"$f":"VLOOKUP('calcolo handicap'!B5,'elenco campi italiani'!$Z$2:$AA$8,2)","v":10},{"$f":"IF('elenco campi italiani'!W11>=40,18,9)","v":18}]
[{"$f":"_xlfn.TEXTJOIN(\" \",TRUE,C12:D12)","v":"ALBARELLA 18 BUCHE"},8,"ALBARELLA","18 BUCHE",72,null,null,72,121,70.5,118,68.2,113,73.8,125,72.5,121,70,116,null,-5]
["ALBISOLA 18 Buche par 64",{"$f":"1+B12","v":9},"ALBISOLA","18 Buche par 64",64,null,null,null,null,62.4,105,60.4,99,null,null,62.8,108,62.8,108,null,-4.9000000000000004,null,"PUNTI STB -36 GARA 18B",null,null,null,"PUNTI STB -18 GARA 9B"]
["ALBISOLA 18 buche par 65",10,"ALBISOLA","18 buche par 65",65,null,null,null,null,62.6,107,60.6,102,null,null,63,109,60.9,105,null,-4.8,null,{"$f":"IF(AA11=9,\"GARA 9 BUCHE\",'calcolo handicap'!B9-36)","v":1},null,null,null,{"$f":"IF('elenco campi italiani'!AA11=9,'calcolo handicap'!B9-18,\"GARA 18 BUCHE\")","v":"GARA 18 BUCHE"}]
["ALBISOLA 18 buche par 66",11,"ALBISOLA","18 buche par 66",66,null,null,null,null,62.8,108,60.8,102,null,null,63.2,110,null,null,null,-4.7,null,"AGS 18BUCHE",null,null,null,"AGS 9BUCHE"]
["ALBISOLA 9 Buche par 32",12,"ALBISOLA","9 Buche par 32",32,null,null,null,null,31.2,105,30.2,99,null,null,31.4,108,null,null,null,-4.5999999999999996,null,{"$f":"IF(AA11=9,\"GARA 9 BUCHE\",ROUND(W11+'calcolo handicap'!D5-W14,0))","v":85},null,null,null,{"$f":"IF(AA11=18,\"GARA 18 BUCHE\",ROUND(2*(W11+'calcolo handicap'!D5)+1-AA14,0))","v":"GARA 18 BUCHE"}]
["ALBISOLA 9 buche par 33",13,"ALBISOLA","9 buche par 33",33,null,null,null,null,31.4,108,30.4,102,null,null,31.6,110,null,null,null,-4.5,null,"SD 18 BUCHE",null,null,null,"SD 9 buche"]
["ALPINO 18 Buche",14,"ALPINO","18 Buche",69,null,null,67.900000000000006,131,66.099999999999994,131,64,126,69.900000000000006,122,68.3,118,65.900000000000006,113,null,-4.4000000000000004,null,{"$f":"IF(AA11=9,\"GARA 9 BUCHE\",+V11*(W16-X11-'calcolo handicap'!B11))","v":11.885400000000002},null,null,null,{"$f":"IF(AA11=18,\"GARA 18 BUCHE\",V11*(AA16-2*X11-'calcolo handicap'!B11/2))","v":"GARA 18 BUCHE"}]
["ALPINO Prime Nove",15,"ALPINO","Prime Nove",35,null,null,34,132,33.1,132,31.9,127,35.1,123,34.299999999999997,118,null,null,null,-4.3]
["ALPINO Seconde Nove",16,"ALPINO","Seconde Nove",34,null,null,33.799999999999997,131,33.1,131,null,null,34.799999999999997,122,34,117,null,null,null,-4.2]
["ALTA BADIA 18 Buche",17,"ALTA BADIA","18 Buche",72,null,null,69.5,129,null,null,null,null,70.400000000000006,133,null,null,null,null,null,-4.0999999999999996]
["ALTA BADIA 9 Buche",18,"ALTA BADIA","9 Buche",36,null,null,34.799999999999997,129,null,null,null,null,35.200000000000003,133,null,null,null,null,null,-4]
["AMBROSIANO 18 Buche",19,"AMBROSIANO","18 Buche",72,null,null,73,133,71.900000000000006,131,67.5,121,75.3,132,73.7,128,71.099999999999994,122,null,-3.9]
["AMBROSIANO Prime Nove",20,"AMBROSIANO","Prime Nove",36,null,null,36.5,133,35.9,131,33.700000000000003,126,37.5,128,36.4,123,35.1,120,null,-3.8]
["AMBROSIANO Seconde Nove",21,"AMBROSIANO","Seconde Nove",36,null,null,36.5,133,36,130,33.9,125,37.799999999999997,135,37.200000000000003,133,35.9,130,null,-3.7]
["ANTOGNOLLA 18 buche",22,"ANTOGNOLLA","18 buche",71,null,null,72.099999999999994,129,70.5,125,66.599999999999994,116,74.099999999999994,125,71.599999999999994,120,67.400000000000006,111,null,-3.6]
["ANTOGNOLLA 9 buche 2019",23,"ANTOGNOLLA","9 buche 2019",35,null,null,null,null,34.799999999999997,128,33,124,null,null,35.4,123,null,null,null,-3.5]
["ANTOGNOLLA prime nove",24,"ANTOGNOLLA","prime nove",36,null,null,null,null,34.9,132,32.9,127,null,null,35.299999999999997,119,null,null,null,-3.4]
["ANTOGNOLLA seconde nove",25,"ANTOGNOLLA","seconde nove",35,null,null,null,null,35.6,118,33.700000000000003,114,null,null,36.299999999999997,120,null,null,null,-3.3]
["AOSTA 18 Buche",26,"AOSTA","18 Buche",62,null,null,null,null,61.1,112,58.6,106,null,null,59.2,107,59.2,107,null,-3.2]
["AOSTA 9 Buche",27,"AOSTA","9 Buche",31,null,null,null,null,30.6,112,29.3,106,null,null,29.6,107,null,null,null,-3.1]
["APPIANO - CAREZZA 18 Buche",28,"APPIANO - CAREZZA","18 Buche",70,null,null,null,null,68.5,126,64.8,117,null,null,70.599999999999994,128,67.599999999999994,122,null,-3]
["APPIANO - CAREZZA 18 buche",29,"APPIANO - CAREZZA","18 buche",70,74.099999999999994,121,72.400000000000006,117,70.2,112,67.400000000000006,106,71.400000000000006,123,68,116,64.8,109,null,-2.9]
["APPIANO - CAREZZA Nove buche",30,"APPIANO - CAREZZA","Nove buche",35,37.1,121,36.200000000000003,117,35.1,112,33.700000000000003,105,35.700000000000003,123,34,116,32.4,109,null,-2.8]
["APPIANO - CAREZZA Nove Buche",31,"APPIANO - CAREZZA","Nove Buche",35,null,null,null,null,34.299999999999997,126,32.4,117,null,null,35.299999999999997,128,33.799999999999997,122,null,-2.7]
["ARCHI CLAUDIO 18 Buche",32,"ARCHI CLAUDIO","18 Buche",66,null,null,null,null,65.900000000000006,112,62.9,105,null,null,66.900000000000006,111,63.8,105,null,-2.6]
["ARCHI CLAUDIO 18 buche par 64",33,"ARCHI CLAUDIO","18 buche par 64",64,null,null,null,null,64.599999999999994,114,61.4,107,null,null,65.400000000000006,113,62.2,107,null,-2.5]
["ARCHI CLAUDIO 9 buche par 32",34,"ARCHI CLAUDIO","9 buche par 32",32,null,null,null,null,32.299999999999997,114,30.7,107,null,null,32.700000000000003,113,31.1,107,null,-2.4]
["ARCHI CLAUDIO Prime Nove",{"$f":"1+B38","v":35},"ARCHI CLAUDIO","Prime Nove",33,null,null,null,null,33,112,31.4,105,null,null,33.5,111,31.9,105,null,-2.2999999999999998]
["ARCHI CLAUDIO US KIDS",36,"ARCHI CLAUDIO","US KIDS",33,null,null,null,null,31.5,106,null,null,null,null,33.5,111,null,null,null,-2.2000000000000002]
["ARENZANO 18 Buche",37,"ARENZANO","18 Buche",72,null,null,null,null,71,133,67.900000000000006,126,null,null,73,133,70.7,128,null,-2.1]
["ARENZANO Nove Buche",38,"ARENZANO","Nove Buche",36,null,null,null,null,35.5,133,34,126,null,null,36.5,133,35.4,128,null,-2]
["ARGENTA 18 Buche",39,"ARGENTA","18 Buche",72,null,null,72.8,126,71.900000000000006,125,68.3,117,74.400000000000006,129,73.599999999999994,128,70.8,122,null,-1.9]
["ARGENTA Prime Nove",40,"ARGENTA","Prime Nove",36,null,null,36.200000000000003,129,35.700000000000003,127,34,123,37.1,129,36.700000000000003,128,35.200000000000003,125,null,-1.8]
["ARGENTA Seconde Nove",41,"ARGENTA","Seconde Nove",36,null,null,36.6,124,36.200000000000003,122,34.200000000000003,117,37.299999999999997,130,36.9,128,35.6,125,null,-1.7]
["ARGENTARIO 18 Buche",42,"ARGENTARIO","18 Buche",71,null,null,74.099999999999994,141,72.400000000000006,138,69.5,131,76.400000000000006,143,72.900000000000006,135,69.900000000000006,129,null,-1.6]
["ARGENTARIO Prime Nove",43,"ARGENTARIO","Prime Nove",36,null,null,36.799999999999997,143,36,141,34.5,138,38.1,144,36.5,137,35,134,null,-1.5]
["ARGENTARIO Seconde Nove",44,"ARGENTARIO","Seconde Nove",35,null,null,37.299999999999997,139,36.4,135,34.9,132,38.299999999999997,141,36.4,134,34.9,131,null,-1.4]
["ARONA 18 buche",45,"ARONA","18 buche",70,null,null,null,null,68.8,129,66,123,null,null,70,125,null,null,null,-1.3]
["ARONA Prime Nove",46,"ARONA","Prime Nove",35,null,null,null,null,34,131,32.5,124,null,null,34.799999999999997,120,null,null,null,-1.2]
["ARZAGA Gary P. 1-9",47,"ARZAGA","Gary P. 1-9",36,null,null,null,null,35,128,33.700000000000003,125,null,null,35.700000000000003,123,34.299999999999997,120,null,-1.1000000000000001]
["ARZAGA Gary Player",48,"ARZAGA","Gary Player",72,null,null,71.8,133,69.900000000000006,128,null,null,72.2,125,71.400000000000006,123,null,null,null,-1]
["ARZAGA GP1 + JN1",49,"ARZAGA","GP1 + JN1",72,null,null,72.5,130,70.900000000000006,125,68.2,119,72.3,124,72.099999999999994,124,69.400000000000006,118,null,-0.9]
["ARZAGA GP1 + JN2",50,"ARZAGA","GP1 + JN2",72,null,null,72.599999999999994,134,70.8,129,67.900000000000006,122,73.5,129,72.099999999999994,127,69.400000000000006,121,null,-0.8]
["ARZAGA Jack N. 1-9",51,"ARZAGA","Jack N. 1-9",36,null,null,null,null,35.9,124,34.5,121,null,null,36.4,125,35,122,null,-0.7]
["ARZAGA Jack Nicklaus",52,"ARZAGA","Jack Nicklaus",72,null,null,73.2,130,71.7,126,68.8,119,73.599999999999994,129,72.8,128,70,122,null,-0.6]
["ASIAGO 18 Buche",53,"ASIAGO","18 Buche",71,null,null,72.5,127,70.2,124,66.400000000000006,115,73.5,127,70.8,124,67.7,117,null,-0.5]
["ASIAGO Prime Nove",54,"ASIAGO","Prime Nove",36,null,null,36.5,128,35.299999999999997,121,33.700000000000003,117,37.299999999999997,128,35.5,125,34.1,122,null,-0.4]
["ASIAGO Seconde Nove",55,"ASIAGO","Seconde Nove",35,null,null,36,125,34.9,126,32.9,121,36.200000000000003,126,35.299999999999997,123,33.6,119,null,-0.3]
["ASOLO Giallo-Giallo",56,"ASOLO","Giallo-Giallo",72,null,null,73.099999999999994,136,71.599999999999994,132,null,null,74.8,131,72.8,127,null,null,null,-0.2]
{"$rows_left_out":846}